{
  "data_set_description": {
    "collection_date": "2013",
    "default_target_attribute": "DepDelay",
    "description": "**Author**: Bureau of Transportation Statistics, Airline Service Quality Performance  \n**Source**: [original](http://www.transtats.bts.gov/) - 2013  \n**Please cite**:   \n\nAirlines Departure Delay Prediction (Regression).\nOriginal data can be found at: http://www.transtats.bts.gov\n\nThis is a processed version of the original data, designed to predict departure delay (in seconds).  \n\nA CSV of the raw data (years 1987-2013) can be be found [here](https://h2o-airlines-unpacked.s3.amazonaws.com/allyears.1987.2013.csv). This is the first 1 million rows (and a subset of the columns) of this CSV file, in ARFF format.",
    "description_version": "1",
    "file_id": "22044748",
    "format": "ARFF",
    "id": "42721",
    "licence": "CC0",
    "md5_checksum": "353192b3e67086d8b43e646992d008d3",
    "minio_url": "https://data.openml.org/datasets/0004/42721/dataset_42721.pq",
    "name": "Airlines_DepDelay_1M",
    "original_data_url": "http://www.transtats.bts.gov/",
    "parquet_url": "https://data.openml.org/datasets/0004/42721/dataset_42721.pq",
    "processing_date": "2020-11-14 03:00:09",
    "status": "active",
    "upload_date": "2020-11-14T02:59:33",
    "url": "https://api.openml.org/data/v1/download/22044748/Airlines_DepDelay_1M.arff",
    "version": "1",
    "visibility": "public"
  }
}