{
  "data_set_description": {
    "citation": "Verma, Rakesh M., Victor Zeng, and Houtan Faridi. &quot;Data Quality for Security Challenges: Case Studies of Phishing, Malware and Intrusion Detection Datasets.&quot; Proceedings of the 2019 ACM SIGSAC Conference on Computer and Communications Security. 2019\n\nSemantic Feature Selection for Text with Application to Phishing Email Detection (Verma and Hossain, 2012)",
    "default_target_attribute": "class",
    "description": "Email dataset 1e",
    "description_version": "1",
    "file_id": "22044469",
    "format": "ARFF",
    "id": "42676",
    "licence": "CC0",
    "md5_checksum": "fe2acaf1cc23a630a4d83e7852ee6108",
    "name": "auml_eml_1_e",
    "processing_date": "2020-09-19 11:14:04",
    "status": "active",
    "upload_date": "2020-09-19T11:13:04",
    "url": "https://www.openml.org/data/v1/download/22044469/auml_eml_1_e.arff",
    "version": "1",
    "visibility": "public"
  }
}