{
  "data_set_description": {
    "collection_date": "2020-09-10",
    "contributor": "None",
    "creator": "RM",
    "description": "test",
    "description_version": "1",
    "file_id": "22044432",
    "format": "arff",
    "id": "42654",
    "language": "English",
    "licence": "Free",
    "md5_checksum": "c398be5822d5a81eed31c3b430e18cdd",
    "minio_url": "https://data.openml.org/datasets/0004/42654/dataset_42654.pq",
    "name": "dataset_time_6",
    "parquet_url": "https://data.openml.org/datasets/0004/42654/dataset_42654.pq",
    "processing_date": "2020-09-10 21:34:02",
    "status": "active",
    "upload_date": "2020-09-10T21:33:51",
    "url": "https://api.openml.org/data/v1/download/22044432/dataset_time_6.arff",
    "version": "1",
    "visibility": "public"
  }
}