{
  "data_set_description": {
    "collection_date": "2020-09-10",
    "contributor": "None",
    "creator": "RM",
    "description": "test",
    "description_version": "1",
    "file_id": "22044425",
    "format": "arff",
    "id": "42647",
    "language": "English",
    "licence": "Free",
    "md5_checksum": "626fe929ca283c6cf117c9cb2dc82051",
    "minio_url": "https://data.openml.org/datasets/0004/42647/dataset_42647.pq",
    "name": "dataset_time_3",
    "parquet_url": "https://data.openml.org/datasets/0004/42647/dataset_42647.pq",
    "processing_date": "2020-09-10 20:28:03",
    "status": "active",
    "upload_date": "2020-09-10T20:27:54",
    "url": "https://api.openml.org/data/v1/download/22044425/dataset_time_3.arff",
    "version": "1",
    "visibility": "public"
  }
}