{
  "data_set_description": {
    "collection_date": "2020-08-24",
    "contributor": "None",
    "creator": "RM",
    "description": "test",
    "description_version": "1",
    "file_id": "22044347",
    "format": "arff",
    "id": "42610",
    "language": "English",
    "licence": "Free",
    "md5_checksum": "94674dd8a5cb0ea12feb36df9db9de33",
    "minio_url": "https://data.openml.org/datasets/0004/42610/dataset_42610.pq",
    "name": "train",
    "parquet_url": "https://data.openml.org/datasets/0004/42610/dataset_42610.pq",
    "processing_date": "2020-08-24 12:38:02",
    "status": "active",
    "upload_date": "2020-08-24T12:37:28",
    "url": "https://api.openml.org/data/v1/download/22044347/train.arff",
    "version": "8",
    "visibility": "public"
  }
}