{
  "data_set_description": {
    "description": "diabetes",
    "description_version": "1",
    "file_id": "22044302",
    "format": "ARFF",
    "id": "42608",
    "licence": "CC0",
    "md5_checksum": "c938f67549dffe7fe96993389669bf36",
    "minio_url": "https://data.openml.org/datasets/0004/42608/dataset_42608.pq",
    "name": "diabetes",
    "parquet_url": "https://data.openml.org/datasets/0004/42608/dataset_42608.pq",
    "processing_date": "2020-08-14 08:37:03",
    "status": "active",
    "upload_date": "2020-08-14T08:36:19",
    "url": "https://api.openml.org/data/v1/download/22044302/diabetes.arff",
    "version": "5",
    "version_label": "1",
    "visibility": "public"
  }
}