{
  "data_set_description": {
    "description": "ef f",
    "description_version": "1",
    "file_id": "21854532",
    "format": "ARFF",
    "id": "42546",
    "licence": "CC0",
    "md5_checksum": "eaa8cae91a1a6cb9881c3636416dc1f0",
    "minio_url": "https://data.openml.org/datasets/0004/42546/dataset_42546.pq",
    "name": "Test_vectors_1500_notrans2",
    "parquet_url": "https://data.openml.org/datasets/0004/42546/dataset_42546.pq",
    "processing_date": "2020-06-22 11:07:02",
    "status": "active",
    "upload_date": "2020-06-22T11:02:14",
    "url": "https://api.openml.org/data/v1/download/21854532/Test_vectors_1500_notrans2.arff",
    "version": "1",
    "visibility": "public"
  }
}