{
  "data_features": {
    "feature": [
      {
        "data_type": "nominal",
        "index": "0",
        "is_ignore": "false",
        "is_row_identifier": "false",
        "is_target": "false",
        "name": "In_your_own_words,_what_would_you_call_the_part_of_?",
        "nominal_value": [
          "36758",
          "4 seasons , next to the ocean with a colonial flare",
          "a beautiful country where you have all seasons, hills, flowers, green grass, tall trees, rivers and streams.",
          "A community with a Bird Sanctuary that is on the outskirts of Denver.",
          "A decent place to live in.",
          "a great place to live in but for the high property taxs",
          "A great place to live.",
          "A grievously sad and sorry excuse for what the locals think of as a modern world.",
          "A little city with no windows or doors or at least this is how it feels if you don't conform",
          "A Midwest city",
          "A mix of urban and rural",
          "A piece of Eden",
          "A rural counytyside",
          "A rural farming area",
          "A shithole",
          "a small town",
          "A southern rural community.",
          "a state, Colorado",
          "a suburban area of Chicago, definetely in the midwest",
          "A taxpayers hell",
          "A verdant little bit of suburbia in the best possible way. A safe haven for former hippies and families with dogs, there are as many trees as there are people in this East Coast town.",
          "al giza",
          "Alaska",
          "ALL FOUR SEASONS ARE NICE BUT THIS WINTER IS THE MOST BRUTAL ONE YET",
          "America",
          "America's Heartland",
          "American south",
          "an island",
          "Appalacha",
          "Appalachia",
          "arizona",
          "Atlantic region",
          "Atlantic States region--Northeast",
          "average",
          "awful, flat, ugly",
          "Backwards",
          "Backwoods",
          "Bad",
          "badlands",
          "Barren and very boring for someone in their early twenties",
          "Bay Area",
          "Beachy",
          "Beautiful",
          "Beautiful and scenic, peaceful and calm. A poor area due to lack of industry but overall an excellent place to live.",
          "Beautiful but cold",
          "Beautiful country, but can be extremely cold and extremely hot.",
          "Beautiful dessert area.",
          "Beautiful Montana!",
          "Beautiful mountain town mixed with college town.",
          "Beautiful, mountainous, friendly, rural, woodsy.",
          "Beautiful, narrow-minded and disconnected",
          "Best of the Midwest, Iowa.",
          "best part of us",
          "Big Lake",
          "Big Sky Country",
          "Bluegrass region of Kentucky",
          "Border state between N & S",
          "Boring",
          "Boring, hilly, cold, the Nasty Nati",
          "Boulder, CO",
          "Buckeye country!",
          "Bucolic",
          "busy & popular",
          "CA",
          "CALIFORNIA",
          "California foothills",
          "Canada",
          "Cape Cod",
          "Carolina coast",
          "CENTRAL",
          "Central Appalachia",
          "central atlantic",
          "Central California",
          "Central Eastern",
          "Central Florida",
          "Central illinois",
          "Central Illinois (the Midwest)",
          "CENTRAL LAWTON,OKLAHOM",
          "Central midwest",
          "central midwest. Entrance to the Ozarks. one of the most beautiful parts of our country with all seasons, flats, hills, trees, flowers, rivers, lakes. has everything you could want.",
          "Central New York",
          "Central northern (Montana)",
          "Central or midwest",
          "central part of US",
          "Central Pennsylvania",
          "Central plains",
          "Central South",
          "Central Southern",
          "Central States or Mid South",
          "Central Texas",
          "Central to the united states .",
          "Central United States",
          "Central US",
          "central usa",
          "Central Valley of California",
          "Chicago",
          "Chicagoland",
          "City",
          "coastal",
          "Coastal New England",
          "COLD",
          "COLD  NORTHEAST",
          "Cold closed",
          "Cold small town",
          "Cold weather",
          "Cold,",
          "Cold, but love the season, diversity and family-friendly environment.",
          "cold, expensive and limiting.",
          "Cold,bleak and weary.",
          "Colorado",
          "Colorado mountains",
          "Colorado!",
          "Colorado/West",
          "Common sense people who live in reality and not fantasy!",
          "Conservative",
          "Corn",
          "Country",
          "Country living",
          "Country outside of Baltimoe",
          "Country suburban city life depends on where you live and which way you travel. The northeast",
          "countryside",
          "County",
          "Cracking and coal",
          "Dallas, TX USA",
          "DC Metro area",
          "DC/MD/VA area",
          "Deep South",
          "Delaware Valley in the Northeast",
          "Denver... Mountains... Colorado",
          "Depressed",
          "Depressing, cold, cloudy, snowy",
          "Desert Northwest",
          "Desert Southwest",
          "Desert Southwest with inability to leave area without having to suspend Bill of Rights of U.S. Constitution by being forced to go through Border Patrol/Customs/Immigration checkpoints through any means of transportation (automobile, rail, aviation, on foot",
          "desert west",
          "Detroit, Michigan, struggling but filled with residents that are survivors.   Cold",
          "Dirty south",
          "Don't know",
          "DORMONT",
          "drab",
          "EAST",
          "East Central Pennsylvania",
          "East central USA",
          "East Coast",
          "East coast with a mix of country side, suburban neighborhoods, and cities.  All of this can be found within a two hour radius of where I live.",
          "east coast/ mid atlantic",
          "east north central",
          "East Texas",
          "East, great lakes area of the US",
          "East/Central",
          "Eastern",
          "Eastern midwest",
          "Eastern Pa",
          "Eastern Pacific Northwest",
          "eastern pennsylvania",
          "Eastern U.S.",
          "Eastern United States",
          "eastern usa",
          "Eastern with lake effect weather.",
          "Expensive and Entertainment Country.",
          "extreme southeast",
          "Fairfax County",
          "Fantastic!",
          "Far West",
          "flat, cold, no trees, western people",
          "Florida",
          "Florida?",
          "Fly over",
          "fly over country!!",
          "Flyover country",
          "frigid",
          "Frigid and liberal",
          "Frozen North",
          "girls, trucks and beer bitch",
          "Glober atlanta",
          "God' Country",
          "God's Country",
          "God's country(northwest us)",
          "Gods country",
          "Gods Country....",
          "Golden State. The best in the Country.",
          "Good place to live .",
          "Good place to live. Has a nice clear difference in all four seasons.",
          "Great",
          "Great American Mid-West",
          "great country side of white plain eastern usa",
          "Great Lakes",
          "Great Lakes area",
          "Great Lakes Region",
          "Great Lakes Region.",
          "Great lakes.",
          "Great Midwest",
          "Great Plains",
          "Great Plains meet deciduous forest",
          "Great weather here in Southern California",
          "Green country -upper south",
          "Gulf Coast",
          "Has it all!  Spring, summer, fall and winter all offer things to do.",
          "Hawaii",
          "Hawaii :)",
          "He",
          "Heart of America",
          "heartbeat of america",
          "Heaven",
          "Hell",
          "Hickville USA",
          "High Desert",
          "High desert pacific new united syates",
          "high plains",
          "High Southwestern Desert.",
          "Home",
          "hoosier country",
          "Horrible winters here in MN and wonder every year why I am doing this?   The season changes are marvelous and we all appreciate them so much.",
          "Hot, sorta uncomfortable, redneck, gun idiot to the max, religiously dark aged, stupid, head up their ass, could really do a better job at being human and needs better education.",
          "Hype Park",
          "I guess Midwest.  Cant really think of any other name.",
          "I live in Illinois, and wish I was young enough to take up my roots and move elsewhere. Politically possibilly the worst state you can live in!",
          "I live in small town Iowa. Rumors travel faster than the people.  Everyone wants to leave but they're sucked in and can't.",
          "I live in the border between the South and the Midwest. Not totally Southern, not totally Midwestern.",
          "I live in the east coast part of NJ Somerset County, Franklin Township. I have lived here for 14 years",
          "I live in the Midwest part of the country",
          "I live in the Rocky Mountain region.",
          "I live on an island in the Pacific Ocean.  Pacific.  Way, way west.   Tropical.",
          "I live on the west coast.",
          "I live out in the west.",
          "I travel throughout the USA and live at various Wal-Marts",
          "I will call the The solitary streets",
          "I would call it the South to Southwest.",
          "I would call this middle area of the country the heartland.",
          "I'm move from Southeastern Kentucky to an area with decent roads,NO Coal Companies and where people can find decent paying jobs",
          "Ice tundra  actually Midwest",
          "in a mess",
          "In the county",
          "in the East",
          "In the sticks, in the south",
          "Indiana",
          "Inland Northwest",
          "Interior west",
          "island",
          "It is the United States in Colorado",
          "Jersey Shore",
          "jkjhj",
          "Kansas",
          "Kind of midwest",
          "Laid back, gorgeous, home! Colorado's the best state to live in!",
          "Lake region",
          "Lancaster",
          "Land - O - The mo's!",
          "Land of Opportunity",
          "Landlocked",
          "Left coast, high taxes, corrupt government, illegal aliens",
          "Liberal midwest",
          "Limiting.",
          "Little .Mexico",
          "Little Siberia!",
          "Living blue in a red state.",
          "Livingston County",
          "Lost",
          "Lower North-East",
          "Lucky to live here",
          "McCandless Township",
          "Merry Go Round of Weather!",
          "metropolitan area or city",
          "Michigan",
          "Mid alantic",
          "Mid america",
          "Mid Atlantic",
          "mid atlantic mid west",
          "Mid Atlantic Region",
          "Mid Atlantic states",
          "Mid Atlantic/North East",
          "Mid East",
          "Mid eastern coastal",
          "Mid Missouri",
          "Mid South",
          "mid states",
          "MID WEST",
          "Mid west or Central Western States",
          "mid West Rocky mountains",
          "Mid West.",
          "Mid Westerner",
          "Mid Wst",
          "Mid-America",
          "Mid-Atlantic",
          "Mid-Atlantic Coast",
          "mid-atlantic coastal area",
          "Mid-Atlantic half the year, Texas the other half",
          "Mid-Atlantic region",
          "mid-Atlantic state",
          "Mid-Atlantic, inland",
          "Mid-Atlantic.",
          "Mid-Atlantice",
          "Mid-East",
          "Mid-eastern appalachia",
          "Mid-north",
          "Mid-sized Southern city",
          "Mid-South",
          "Mid-West",
          "mid-West / central Illinois",
          "Mid-West.",
          "Mid-west/Great Lakes",
          "Mid-Western, Great Lakes Region",
          "MidAtlantic",
          "middle",
          "Middle America",
          "middle america; large town, small city",
          "Middle Atlantic",
          "middle atlantic state",
          "Middle east",
          "middle midwest",
          "middle of the north east",
          "Middle Plains",
          "Middle West",
          "Mideast",
          "Mideastern, but that doesn't go over well. So, Midwestern.",
          "midewest",
          "midewest/south",
          "midsouth",
          "Midweat",
          "midwesr",
          "MIDWEST",
          "Midwest - Northeast Ohio",
          "Midwest - the corn belt",
          "Midwest America, Indiana, USA,",
          "Midwest farm country",
          "Midwest nonsense",
          "Midwest North America",
          "Midwest or Great Lakes",
          "Midwest or heartland",
          "Midwest rural",
          "Midwest rural and urban",
          "Midwest rural area",
          "midwest united states",
          "Midwest urban",
          "Midwest US",
          "Midwest USA",
          "Midwest, great lakes",
          "Midwest, Great Lakes region",
          "Midwest, on the edge of East",
          "Midwest- Chicago",
          "Midwest.",
          "Midwest. Fairly dull.",
          "Midwest. the frozen tundra",
          "Midwest. The Heartland",
          "Midwest. The Heartland.",
          "midwest...northern midwest...i live in northern michigan",
          "Midwest/ frozen tundra",
          "Midwest/central",
          "Midwest/Eastern.  Just East of the Mississippi should be  Mideastern.",
          "Midwest/Great Lakes",
          "Midwest/Northern Plains",
          "Midwest/plains",
          "Midwester",
          "MIDwESTERN",
          "Midwestern area big city",
          "Midwestern US",
          "Midwesterner",
          "MidwestxX",
          "midwwest",
          "Minne-snow-ta",
          "Minnesota",
          "missiouri",
          "Mix of city and woods.",
          "Mojave Desert, California",
          "Montana",
          "Monterey Bay Area",
          "Mormonville",
          "Mountain region - West",
          "Mountain States",
          "Mountain states.",
          "mountain top - summit",
          "Mountain town",
          "Mountain West",
          "mountain zone",
          "Mountain/central/west",
          "Mountains and river",
          "Mountains or west",
          "mountains south west",
          "Mountains, beautiful.",
          "mountan states",
          "n central",
          "N.E.",
          "ne",
          "NE TN",
          "Near West",
          "new and gleaming",
          "New England",
          "New Jersey",
          "New Mexico",
          "NEW YORK",
          "New York City",
          "New York City, a city-state a la Athens. For people who don't know what that means, I'd say Mid-Atlantic",
          "New York City, the east, the east coast",
          "New York/Northeast",
          "Nice place to raise a family. Not too much traffic. A little noisy at times. If you like diesel fumes, you'll love it hear.",
          "nidwest",
          "Norhteast",
          "North",
          "North America",
          "North America  Mid West",
          "North Carolina",
          "North Central",
          "North central America",
          "North Central Pa.",
          "North Central States",
          "NORTH CENTRAL TEXAS",
          "North Central/east",
          "North coast",
          "North East",
          "North East (hell)",
          "North East Cost or The Big Apple",
          "North east mid west",
          "North East Pennsylvania",
          "North East USA",
          "North East, near the Appalachian Trail and Ohio River.",
          "North east. New England",
          "North east/Appalachian mountain region",
          "NORTH EASTERN",
          "North Eastern Kentucky",
          "North eastern United States",
          "North eastern US",
          "north mid-west",
          "North Midwestern-scenic beauty",
          "North West",
          "north western us",
          "North-east",
          "Northcentral Midwest",
          "NORTHEAST",
          "northeast (that's because I just moved to philadelphia, but I moved here from Cleveland, OH which is definitely Midwest)",
          "northeast atlantic",
          "northeast central north america",
          "Northeast Ohio",
          "Northeast or philadelphia",
          "northeast Pa",
          "northeast PA. rural, on the edge of the appalachians",
          "Northeast Region",
          "Northeast shore",
          "Northeast US",
          "Northeast USA",
          "Northeast, lived in Nebraska for 25 years.",
          "NorthEast, New England",
          "Northeastern",
          "Northeastern Midwest.",
          "Northeastern Pennsylvania",
          "Northeastern United States",
          "Northeastern United States (New Jersey)",
          "Northeastern usa",
          "Northeastern Wisconsin",
          "northern",
          "Northern America",
          "Northern California",
          "Northern California/West Coast",
          "Northern central",
          "Northern climate, Alaska",
          "Northern Michigan",
          "Northern Mid Atlantic",
          "Northern Mid West",
          "Northern Midwest",
          "nORTHERN mINNESOTA",
          "Northern New England",
          "northern New York",
          "Northern Plains",
          "Northern Rockies Region",
          "Northern us",
          "Northern Virginia",
          "Northern Virginia suburbs",
          "Northern Wisconsin",
          "Northwest",
          "Northwest country",
          "Northwestern",
          "northwoods",
          "Northwoods.",
          "not sure",
          "Not the Midwest, but `Minnesota`.  I don't consider MN 'west'.",
          "NoVa on the east coast",
          "NW",
          "Ny tri state area",
          "Ohio",
          "Ohio Valley",
          "Ohio.",
          "ok",
          "Okay, not to exciting.",
          "Oklahoma",
          "One of the best places in te entire world",
          "open",
          "out of touch",
          "Pacific",
          "Pacific Coast",
          "Pacific Coast  South West United States",
          "PACIFIC NORTH WEST",
          "Pacific Northwest",
          "Pacific Northwest, Cascadia",
          "Pacific Northwest, more specifically, Central Oregon High Desert",
          "Pacific Northwest.",
          "Pacific Northwestner",
          "Pacific NW",
          "Pacific Southwest",
          "pacific west",
          "Pacificp  '",
          "Paradise",
          "Paradise, Florida is amazing",
          "partial South but not deep South.",
          "Pennsyltucky",
          "Pennsylvania",
          "picturesque, brutal winter this year.",
          "pitts",
          "Pittsburgh",
          "Plains",
          "Plains state",
          "Pleasant",
          "PNW",
          "Practically perfect",
          "Pretty scenery, filled with trashy shitty minded idiots.",
          "Promise Land",
          "Raining city",
          "Rednecksville",
          "Rivirvue",
          "rockies",
          "Rocky Mountain",
          "Rocky Mountain foothills/ Midwest",
          "Rocky Mountain Region",
          "Rocky Mountain West",
          "Rocky Mountains",
          "Ruff but wonderful",
          "Rural",
          "rural eastern ky",
          "rural Indiana",
          "rural mid Michigan",
          "Rural Midwest",
          "Rural missouri",
          "rural northeast",
          "rural northwestern Pennsylvania",
          "Rural Pennsylvania",
          "rural south",
          "rural southeast",
          "rural western Maine",
          "Rural Wisconsin",
          "Rural, city like",
          "Rural, hickish crap.",
          "Rural, small town, country",
          "Rural, Western Colorado",
          "rural-desert",
          "Rust Belt",
          "Safe, mild expenses",
          "San Francisco Bay Area",
          "Scenic",
          "Scenic, mostly progressive, beautiful, warm, friendly, coastal, temperate, wine country",
          "SE",
          "SE. Country",
          "Semi progressive. Safe. Artistic. Intelligent.",
          "severely broken",
          "Sf",
          "Silicon Valley",
          "Sleepless",
          "Smack dab in the middle.",
          "small country area in the southern part of Arkansas",
          "small quaint town",
          "Small town",
          "Small village",
          "Small, rugged, and to find entertainment you have to leave travel a bit.",
          "snooty",
          "snooty and unfriendly",
          "Snowy",
          "So far South you're starting to head North again.",
          "SoCal",
          "SOME WHAT SOUTHERN",
          "something related to the North Pole",
          "sonoran desert",
          "Sourheast",
          "South",
          "South Atlantic",
          "South Carolina",
          "South Cental",
          "South Central",
          "South Central Kentucky",
          "South Central Pennsylvania",
          "South Central U.S.",
          "south central Virginia",
          "South Central. Country",
          "South Chicago suburbs",
          "South East",
          "South eastern",
          "South eastern United States",
          "South Florida",
          "South Florida where the sun always shines",
          "South or mid-south",
          "South or Southeastern",
          "South Philly",
          "south redneck heaven",
          "South Texas",
          "South US",
          "South West",
          "south west suburban",
          "South west United States",
          "South-Central  (Oklahoma)/Midwest",
          "South-Central Midwest",
          "South-Midwest",
          "Southeast",
          "SouthEast beautiful, mountainous",
          "Southeast Colorado",
          "SOUTHEAST FLORIDA",
          "Southeast Georgia",
          "Southeast Idaho",
          "Southeast Pa",
          "Southeast Texas",
          "Southeast USA",
          "southeast Virginia",
          "Southeastern",
          "Southeastern U.S.",
          "Southeastern United States of America",
          "Southeasters United States or the Deep South",
          "Southern",
          "Southern America",
          "SOUTHERN CALIFORNIA",
          "Southern California, West Coast",
          "Southern clifornia",
          "Southern country",
          "Southern Illinois",
          "Southern Illinois/Midwest",
          "Southern Indiana",
          "Southern Mid-West",
          "Southern Mid-West, The `Bible Belt,` Oklahoma",
          "Southern Midwest",
          "southern peninsula",
          "Southern Plains",
          "Southern Rocky Mountains",
          "Southern US",
          "Southwest",
          "Southwest coastal",
          "Southwest Florida",
          "Southwest Midwest",
          "Southwest Missouri",
          "Southwest or Rocky Mountains",
          "Southwest pennsylvania",
          "Southwest United States",
          "Southwest, suburban",
          "Southwestern",
          "southwestern pacific",
          "southwestern pennsylvania",
          "Spoiled",
          "Sub Tropical",
          "Suburban",
          "Suburban Chicago",
          "suburbia",
          "Suburbs",
          "sunny",
          "Sunny California",
          "Sunny Florida",
          "Sunny south fl",
          "Sunny Southern California",
          "Sunny, southern Ca.",
          "Sunshine State",
          "Suthe eastern US",
          "te northwest",
          "Texan",
          "TEXAS",
          "Texas  southeast",
          "Texas where everything is bigger, better, and more friendly than most states.",
          "TEXAS!",
          "Texas.",
          "The area is more rural, but very close to several ` large ` cities. I consider the region as Mid Eastern",
          "the armpit of america",
          "The armpit of the nation.",
          "The Bay Area",
          "The BAy Area (northern California)",
          "The beautiful Northwest of the United States.",
          "The best",
          "The best evn climate. Not to hot or not to cold.",
          "the best place to live.  Get to experience all the different climates.  Friendly people.  Reasonable cost of living.",
          "The Big Apple",
          "The Buckeye state",
          "The City",
          "The classiest part of the south.",
          "The Cornbelt",
          "the country, south, but not rural",
          "The Deep South",
          "The Desert",
          "The dirty south",
          "The dirty `mitten` akaMichigan",
          "The Diverse part",
          "The East",
          "The East Coast",
          "The east.",
          "The Eastern Alaska",
          "The far west.",
          "The Great Lakes",
          "The Great Lakes Region",
          "The Great Lakes Region.",
          "The Great Lakes State.",
          "the great midwest",
          "The Great Plains",
          "The greatest aka NYC!",
          "The greatest part of the country. Always something to do. The climate is just right, alm,ost always. Four definite but fairly mild seasons compared to the rest of the country.",
          "the gulf coast",
          "the heart land of America",
          "The Heartland",
          "The Lowcountry",
          "The mid west, rust belt",
          "the Mid-Atlantic region",
          "the mid-Atlantic region...or else maybe `D.C. suburbs`",
          "The Mid-West",
          "The mid-west. Specifically, Wisconsin.",
          "The Mid-West. The Heartland, The best location in the Nation.",
          "The midatlantic",
          "The middle of the middle",
          "THE MIDWEST",
          "the midwest DUH",
          "The Midwest Region",
          "the midwest region.",
          "The Midwest.",
          "The midwest.  The rust belt.",
          "The midwest.  The rust belt.  The snow belt.",
          "The Midwest/Great Plains",
          "the mitten state",
          "the most beautiful desert in the world!",
          "the most beautiful place in the world",
          "the Mountain west",
          "The North East",
          "The north midwest",
          "The North West",
          "The Northeast",
          "The Northeast or central New Jersey, sometimes South Central NJ, depending upon the 'scope' of the issue",
          "The Northeast.",
          "The Northeast.  More specifically, Upstate New York",
          "The Northeast. Or the mid atlantic states.",
          "The northeastern part of the southern half of the North West",
          "THE NORTHWEST",
          "The only semi-descent place to live in this country.",
          "The Pacific Northwest",
          "The polluted capitol of the West",
          "The Regressive South",
          "The Rural Mid-West",
          "The South",
          "The south or southeast.  Also, of  course, Appalachia.",
          "The South, but I being so close to Missouri, I prefer midwest.",
          "The South, Mid-South, actually.",
          "The south, or maybe just Texas since its really more western than southern",
          "The South-East",
          "The south.",
          "The South. Texas",
          "The Southeast",
          "The Southeast.",
          "The Southwest",
          "The subtropics",
          "the suburbs of philadelphia",
          "The sunniest state in America",
          "The tri-state area",
          "THE UNITED STATES",
          "The Upper Midwest",
          "The Upper Plains",
          "The upper south",
          "The Washington, DC Metro area",
          "The West",
          "The West Coast",
          "The West Coast.",
          "The west.",
          "The Wild West",
          "The woods near the beach on the southeastern coach of Lake Michigan",
          "to close to the city",
          "trashy and racist",
          "tri-state",
          "Tri-state area.",
          "tropical island",
          "U.S. Capitol",
          "U.S.A.",
          "Unique.  We experience the four seasons each year and each one is unique in its own way.  Beauty abounds in the Midwest.",
          "United state of America",
          "United States",
          "United States of America",
          "unstable",
          "Up nort",
          "upper mid west",
          "Upper mid west.",
          "Upper Mid-West",
          "Upper mid-west region of the united States",
          "upper midweat",
          "Upper MIdwest",
          "upper midwest tundra",
          "Upper Midwest.",
          "Upper Penninsula, Yoopers",
          "Upper Plains",
          "Upper Plains States",
          "upper south",
          "Upstate New York",
          "Upstate NY",
          "Urban",
          "urban/suburban, mid-western city",
          "US",
          "US - Minnesota",
          "US Capital District of the Mid Atlantic Region",
          "US NorthEast",
          "USA",
          "USA upper midwest",
          "Vermont is beautiful during all seasons.",
          "VERY CHANGEABLE",
          "Very Cold",
          "Very Country",
          "Very expensive, but worth it (New Jersey).",
          "Very rural and peaceful",
          "Very rural red neck backwoods america.",
          "very sunny",
          "Virginia",
          "Virginia Piedmont",
          "WA",
          "Warm & sunny most of the winter. Great birding areas particularly in winter - Florida. IN summer Michigan is sunny and lovely.",
          "Washington DC suburb",
          "Washington suburbs",
          "Washington, DC",
          "WAY North ;)",
          "We live out in the country. No surrounding homes on 5 aches",
          "Weather Fabulous",
          "Weird",
          "West",
          "West chester",
          "West Coast",
          "West Coast  SoCal  Southern California",
          "West coast.",
          "West Coast.  Left Wing radicals that have no clue of life and trying to mess up everything",
          "West Virginia",
          "West Virginia or too close to Washington DC",
          "West, in southern Idaho",
          "WESTCOAST",
          "Western",
          "western Kentucky",
          "western mid atlantic",
          "western NY or the northeast",
          "Western PA",
          "Western part of U.S.",
          "Western Pennsylvania",
          "WESTERN REGION",
          "Western Slope of the Rockies of Colorado",
          "Western States",
          "Western U.S.",
          "Western United Sates",
          "Western United States",
          "WESTERN USA",
          "Western, Midwest, small city.",
          "Wet but beautiful when the sun comes out",
          "Widwest",
          "windy, western, cold, home",
          "Wonderful weather Colorado",
          "zdfhg",
          "`America` ---  West Coast"
        ],
        "number_of_missing_values": "1"
      },
      {
        "data_type": "nominal",
        "index": "1",
        "is_ignore": "false",
        "is_row_identifier": "false",
        "is_target": "false",
        "name": "Personally_identification_as_a_Midwesterner?",
        "nominal_value": [
          "A lot",
          "Not at all",
          "Not much",
          "Some"
        ],
        "number_of_missing_values": "0"
      },
      {
        "data_type": "nominal",
        "index": "2",
        "is_ignore": "false",
        "is_row_identifier": "false",
        "is_target": "false",
        "name": "Illinois_in_MW?",
        "nominal_value": [
          "No",
          "Yes"
        ],
        "number_of_missing_values": "0"
      },
      {
        "data_type": "nominal",
        "index": "3",
        "is_ignore": "false",
        "is_row_identifier": "false",
        "is_target": "false",
        "name": "Indiana_in_MW?",
        "nominal_value": [
          "No",
          "Yes"
        ],
        "number_of_missing_values": "0"
      },
      {
        "data_type": "nominal",
        "index": "4",
        "is_ignore": "false",
        "is_row_identifier": "false",
        "is_target": "false",
        "name": "Iowa_in_MW?",
        "nominal_value": [
          "No",
          "Yes"
        ],
        "number_of_missing_values": "0"
      },
      {
        "data_type": "nominal",
        "index": "5",
        "is_ignore": "false",
        "is_row_identifier": "false",
        "is_target": "false",
        "name": "Kansas_in_MW?",
        "nominal_value": [
          "No",
          "Yes"
        ],
        "number_of_missing_values": "0"
      },
      {
        "data_type": "nominal",
        "index": "6",
        "is_ignore": "false",
        "is_row_identifier": "false",
        "is_target": "false",
        "name": "Michigan_in_MW?",
        "nominal_value": [
          "No",
          "Yes"
        ],
        "number_of_missing_values": "0"
      },
      {
        "data_type": "nominal",
        "index": "7",
        "is_ignore": "false",
        "is_row_identifier": "false",
        "is_target": "false",
        "name": "Minnesota_in_MW?",
        "nominal_value": [
          "No",
          "Yes"
        ],
        "number_of_missing_values": "0"
      },
      {
        "data_type": "nominal",
        "index": "8",
        "is_ignore": "false",
        "is_row_identifier": "false",
        "is_target": "false",
        "name": "Missouri_in_MW?",
        "nominal_value": [
          "No",
          "Yes"
        ],
        "number_of_missing_values": "0"
      },
      {
        "data_type": "nominal",
        "index": "9",
        "is_ignore": "false",
        "is_row_identifier": "false",
        "is_target": "false",
        "name": "Nebraska_in_MW?",
        "nominal_value": [
          "No",
          "Yes"
        ],
        "number_of_missing_values": "0"
      },
      {
        "data_type": "nominal",
        "index": "10",
        "is_ignore": "false",
        "is_row_identifier": "false",
        "is_target": "false",
        "name": "North_Dakota_in_MW?",
        "nominal_value": [
          "No",
          "Yes"
        ],
        "number_of_missing_values": "0"
      },
      {
        "data_type": "nominal",
        "index": "11",
        "is_ignore": "false",
        "is_row_identifier": "false",
        "is_target": "false",
        "name": "Ohio_in_MW?",
        "nominal_value": [
          "No",
          "Yes"
        ],
        "number_of_missing_values": "0"
      },
      {
        "data_type": "nominal",
        "index": "12",
        "is_ignore": "false",
        "is_row_identifier": "false",
        "is_target": "false",
        "name": "South_Dakota_in_MW?",
        "nominal_value": [
          "No",
          "Yes"
        ],
        "number_of_missing_values": "0"
      },
      {
        "data_type": "nominal",
        "index": "13",
        "is_ignore": "false",
        "is_row_identifier": "false",
        "is_target": "false",
        "name": "Wisconsin_in_MW?",
        "nominal_value": [
          "No",
          "Yes"
        ],
        "number_of_missing_values": "0"
      },
      {
        "data_type": "nominal",
        "index": "14",
        "is_ignore": "false",
        "is_row_identifier": "false",
        "is_target": "false",
        "name": "Arkansas_in_MW?",
        "nominal_value": [
          "No",
          "Yes"
        ],
        "number_of_missing_values": "0"
      },
      {
        "data_type": "nominal",
        "index": "15",
        "is_ignore": "false",
        "is_row_identifier": "false",
        "is_target": "false",
        "name": "Colorado_in_MW?",
        "nominal_value": [
          "No",
          "Yes"
        ],
        "number_of_missing_values": "0"
      },
      {
        "data_type": "nominal",
        "index": "16",
        "is_ignore": "false",
        "is_row_identifier": "false",
        "is_target": "false",
        "name": "Kentucky_in_MW?",
        "nominal_value": [
          "No",
          "Yes"
        ],
        "number_of_missing_values": "0"
      },
      {
        "data_type": "nominal",
        "index": "17",
        "is_ignore": "false",
        "is_row_identifier": "false",
        "is_target": "false",
        "name": "Oklahoma_in_MW?",
        "nominal_value": [
          "No",
          "Yes"
        ],
        "number_of_missing_values": "0"
      },
      {
        "data_type": "nominal",
        "index": "18",
        "is_ignore": "false",
        "is_row_identifier": "false",
        "is_target": "false",
        "name": "Pennsylvania_in_MW?",
        "nominal_value": [
          "No",
          "Yes"
        ],
        "number_of_missing_values": "0"
      },
      {
        "data_type": "nominal",
        "index": "19",
        "is_ignore": "false",
        "is_row_identifier": "false",
        "is_target": "false",
        "name": "West_Virginia_in_MW?",
        "nominal_value": [
          "No",
          "Yes"
        ],
        "number_of_missing_values": "0"
      },
      {
        "data_type": "nominal",
        "index": "20",
        "is_ignore": "false",
        "is_row_identifier": "false",
        "is_target": "false",
        "name": "Montana_in_MW?",
        "nominal_value": [
          "No",
          "Yes"
        ],
        "number_of_missing_values": "0"
      },
      {
        "data_type": "nominal",
        "index": "21",
        "is_ignore": "false",
        "is_row_identifier": "false",
        "is_target": "false",
        "name": "Wyoming_in_MW?",
        "nominal_value": [
          "No",
          "Yes"
        ],
        "number_of_missing_values": "0"
      },
      {
        "data_type": "nominal",
        "index": "22",
        "is_ignore": "false",
        "is_row_identifier": "false",
        "is_target": "false",
        "name": "ZIP_Code",
        "nominal_value": [
          "10001",
          "10003",
          "10007",
          "1001",
          "10010",
          "10019",
          "10024",
          "10028",
          "10033",
          "10038",
          "10065",
          "10128",
          "10302",
          "10308",
          "1040",
          "10463",
          "10467",
          "10469",
          "10512",
          "10547",
          "10583",
          "10605",
          "10803",
          "10901",
          "11023",
          "11040",
          "11207",
          "11209",
          "11228",
          "112345",
          "11358",
          "11372",
          "11374",
          "11414",
          "11422",
          "11547",
          "11566",
          "11570",
          "11691",
          "11706",
          "11768",
          "11782",
          "12010",
          "12077",
          "12144",
          "12209",
          "12401",
          "12533",
          "12583",
          "13030",
          "13135",
          "13332",
          "13411",
          "13601",
          "13902",
          "14026",
          "14031",
          "14094",
          "14125",
          "1420",
          "14214",
          "14223",
          "14423",
          "14450",
          "14477",
          "14513",
          "14519",
          "14612",
          "14616",
          "14618",
          "14623",
          "1463",
          "14850",
          "14882",
          "15007",
          "15012",
          "15021",
          "15044",
          "15061",
          "15068",
          "15074",
          "15102",
          "15108",
          "15146",
          "15147",
          "15203",
          "15206",
          "15208",
          "15213",
          "15214",
          "15216",
          "15217",
          "15218",
          "15226",
          "15228",
          "15232",
          "15234",
          "15236",
          "15237",
          "15301",
          "15317",
          "15327",
          "1534",
          "15469",
          "15613",
          "15642",
          "15650",
          "15665",
          "15701",
          "15801",
          "15905",
          "15924",
          "15963",
          "16001",
          "1604",
          "16059",
          "16063",
          "16066",
          "1609",
          "16117",
          "16148",
          "16242",
          "16341",
          "16365",
          "16403",
          "16412",
          "16415",
          "16421",
          "16508",
          "16509",
          "16510",
          "16601",
          "16602",
          "16639",
          "16652",
          "16686",
          "16749",
          "16802",
          "16803",
          "16828",
          "16841",
          "16872",
          "170",
          "17013",
          "17022",
          "17042",
          "17045",
          "17046",
          "17061",
          "17065",
          "17068",
          "17078",
          "17097",
          "17110",
          "17202",
          "17267",
          "1730",
          "17307",
          "17315",
          "17316",
          "17325",
          "17339",
          "17363",
          "17402",
          "17527",
          "17551",
          "17552",
          "17566",
          "17601",
          "17602",
          "17701",
          "17740",
          "17745",
          "17747",
          "17777",
          "17815",
          "17931",
          "18011",
          "18015",
          "18017",
          "18020",
          "18037",
          "18038",
          "18040",
          "18042",
          "18052",
          "18058",
          "18062",
          "18069",
          "18078",
          "18109",
          "18235",
          "1824",
          "18252",
          "18360",
          "18407",
          "1844",
          "18444",
          "18504",
          "18505",
          "1851",
          "1861",
          "18651",
          "18657",
          "18661",
          "1876",
          "1880",
          "18801",
          "18901",
          "18902",
          "18929",
          "18954",
          "18963",
          "18964",
          "18966",
          "18976",
          "19002",
          "19006",
          "19010",
          "19020",
          "19023",
          "19030",
          "19031",
          "19036",
          "19038",
          "19043",
          "19063",
          "19064",
          "19083",
          "19103",
          "19104",
          "19106",
          "19114",
          "19116",
          "19118",
          "19119",
          "19120",
          "19124",
          "19130",
          "19131",
          "19133",
          "19135",
          "19143",
          "19146",
          "19147",
          "19148",
          "19149",
          "19152",
          "19317",
          "19348",
          "19352",
          "19382",
          "19395",
          "19403",
          "19422",
          "19426",
          "19446",
          "19460",
          "19464",
          "19492",
          "19508",
          "19518",
          "19520",
          "19540",
          "19567",
          "19604",
          "19606",
          "19810",
          "1983",
          "20001",
          "20003",
          "20007",
          "20009",
          "20010",
          "20011",
          "20012",
          "20018",
          "20036",
          "20106",
          "20110",
          "20147",
          "20151",
          "20170",
          "2025",
          "2038",
          "20735",
          "20770",
          "20854",
          "20895",
          "20902",
          "20906",
          "20910",
          "20912",
          "21012",
          "21046",
          "21060",
          "21061",
          "21078",
          "21128",
          "21131",
          "21146",
          "21207",
          "21209",
          "21214",
          "21227",
          "21234",
          "2125",
          "2127",
          "2128",
          "2130",
          "2134",
          "21651",
          "2169",
          "21701",
          "21740",
          "21787",
          "2184",
          "22003",
          "22044",
          "22152",
          "22181",
          "22192",
          "22193",
          "22207",
          "22303",
          "22578",
          "22801",
          "23072",
          "23219",
          "23221",
          "23236",
          "2343",
          "23464",
          "23518",
          "2360",
          "23841",
          "23970",
          "24013",
          "24016",
          "24018",
          "24151",
          "24319",
          "24333",
          "24354",
          "24502",
          "24572",
          "2461",
          "24801",
          "25301",
          "25304",
          "25313",
          "2536",
          "25401",
          "25405",
          "25411",
          "25413",
          "25541",
          "2556",
          "25705",
          "25801",
          "26150",
          "26260",
          "2633",
          "26354",
          "26362",
          "26505",
          "26624",
          "27101",
          "27104",
          "2720",
          "2721",
          "27217",
          "27260",
          "27265",
          "27295",
          "27406",
          "2748",
          "27502",
          "27513",
          "27520",
          "27526",
          "27545",
          "27560",
          "27583",
          "27587",
          "2760",
          "2764",
          "27896",
          "28056",
          "28106",
          "28173",
          "28227",
          "28312",
          "28374",
          "28390",
          "28504",
          "2852",
          "28540",
          "28601",
          "28607",
          "28692",
          "2879",
          "28791",
          "28792",
          "2906",
          "29061",
          "29073",
          "2912",
          "2917",
          "2919",
          "29201",
          "29301",
          "29349",
          "29405",
          "29412",
          "29464",
          "29466",
          "29615",
          "29620",
          "29621",
          "29625",
          "29642",
          "29649",
          "29664",
          "29707",
          "29710",
          "29732",
          "30004",
          "30030",
          "30039",
          "30041",
          "30044",
          "30052",
          "30067",
          "30087",
          "30092",
          "30093",
          "30097",
          "30110",
          "30182",
          "30188",
          "30263",
          "30309",
          "30324",
          "30329",
          "30341",
          "30458",
          "30506",
          "3060",
          "30720",
          "3079",
          "3102",
          "31021",
          "3104",
          "31061",
          "31088",
          "31092",
          "31201",
          "31308",
          "31566",
          "31636",
          "32034",
          "32114",
          "32117",
          "32129",
          "32137",
          "32304",
          "32308",
          "32421",
          "32503",
          "32536",
          "32571",
          "32607",
          "32608",
          "32617",
          "32653",
          "32708",
          "32712",
          "32740",
          "32776",
          "32792",
          "32803",
          "32810",
          "32821",
          "32824",
          "32835",
          "32937",
          "32963",
          "3301",
          "33021",
          "33027",
          "33033",
          "33064",
          "33134",
          "33138",
          "33186",
          "33319",
          "33326",
          "33411",
          "33417",
          "33460",
          "33461",
          "33469",
          "33472",
          "33473",
          "33487",
          "33584",
          "33596",
          "33612",
          "33613",
          "33614",
          "33619",
          "33624",
          "33714",
          "33756",
          "33763",
          "33774",
          "33782",
          "33785",
          "33852",
          "33913",
          "34209",
          "34210",
          "34219",
          "34231",
          "34239",
          "34240",
          "34448",
          "34654",
          "34683",
          "34743",
          "34761",
          "34952",
          "35127",
          "35209",
          "35214",
          "352542",
          "35601",
          "35603",
          "35810",
          "36067",
          "36530",
          "36695",
          "37072",
          "37122",
          "37128",
          "37130",
          "37203",
          "37209",
          "37214",
          "37215",
          "37411",
          "37415",
          "37642",
          "37659",
          "37748",
          "37841",
          "37914",
          "37917",
          "37919",
          "38016",
          "38017",
          "38104",
          "38138",
          "38167",
          "38301",
          "38821",
          "39180",
          "39202",
          "39327",
          "39401",
          "39443",
          "40026",
          "4011",
          "40210",
          "40213",
          "40214",
          "40216",
          "40220",
          "40241",
          "40261",
          "40272",
          "40291",
          "40299",
          "40324",
          "40342",
          "40379",
          "40502",
          "40503",
          "40509",
          "40513",
          "40517",
          "41001",
          "4101",
          "41015",
          "41017",
          "4103",
          "41051",
          "41075",
          "41076",
          "41169",
          "41175",
          "41240",
          "41339",
          "41522",
          "41722",
          "42001",
          "42003",
          "42027",
          "42071",
          "4210",
          "42103",
          "42129",
          "42134",
          "4220",
          "42206",
          "42301",
          "42303",
          "42352",
          "4261",
          "42729",
          "43014",
          "43015",
          "43016",
          "43026",
          "43035",
          "43054",
          "43055",
          "43056",
          "43062",
          "43066",
          "43081",
          "43123",
          "43130",
          "43138",
          "43147",
          "43162",
          "43202",
          "43207",
          "43214",
          "43221",
          "43224",
          "43229",
          "43230",
          "43232",
          "43235",
          "43302",
          "43315",
          "43316",
          "43332",
          "43351",
          "43357",
          "43416",
          "43430",
          "43469",
          "43606",
          "43611",
          "43612",
          "43615",
          "43616",
          "43623",
          "43758",
          "43920",
          "44012",
          "44023",
          "44024",
          "44035",
          "44044",
          "44053",
          "44054",
          "44062",
          "44070",
          "44074",
          "44077",
          "44081",
          "44087",
          "44090",
          "44094",
          "44103",
          "44105",
          "44106",
          "44107",
          "44109",
          "44113",
          "44115",
          "44118",
          "44120",
          "44121",
          "44122",
          "44125",
          "44129",
          "44130",
          "44133",
          "44135",
          "44139",
          "44145",
          "44221",
          "44233",
          "44236",
          "44240",
          "44256",
          "4427",
          "44278",
          "44280",
          "44305",
          "44310",
          "44312",
          "44313",
          "44333",
          "44405",
          "44406",
          "44429",
          "44481",
          "44505",
          "44601",
          "44612",
          "44618",
          "44646",
          "44662",
          "44691",
          "44870",
          "45002",
          "45011",
          "45014",
          "45040",
          "45044",
          "45056",
          "45066",
          "45069",
          "45133",
          "45150",
          "45202",
          "45211",
          "45212",
          "45215",
          "45223",
          "45227",
          "45231",
          "45233",
          "45240",
          "45241",
          "45243",
          "45244",
          "45255",
          "4530",
          "45321",
          "45324",
          "45331",
          "45334",
          "45342",
          "45365",
          "45377",
          "45385",
          "45414",
          "45419",
          "45420",
          "45424",
          "45434",
          "45440",
          "45458",
          "45503",
          "45601",
          "45640",
          "45651",
          "45693",
          "45701",
          "45806",
          "45822",
          "45840",
          "46013",
          "46032",
          "46037",
          "46060",
          "46064",
          "4609",
          "46107",
          "46113",
          "46201",
          "46220",
          "46224",
          "46226",
          "46227",
          "46234",
          "46235",
          "46236",
          "46237",
          "46238",
          "46239",
          "46250",
          "46256",
          "46259",
          "46260",
          "46268",
          "46311",
          "46322",
          "46323",
          "46350",
          "46385",
          "46528",
          "46545",
          "46552",
          "46562",
          "46563",
          "46582",
          "46614",
          "46637",
          "46703",
          "46777",
          "46783",
          "46809",
          "46819",
          "46845",
          "46902",
          "46952",
          "47006",
          "47040",
          "47130",
          "47150",
          "47166",
          "47167",
          "47220",
          "47250",
          "47274",
          "47303",
          "47330",
          "47348",
          "47371",
          "47401",
          "47403",
          "47424",
          "47581",
          "47586",
          "47630",
          "47711",
          "47712",
          "47715",
          "47803",
          "47901",
          "47905",
          "47906",
          "47928",
          "48009",
          "48017",
          "48021",
          "48035",
          "48038",
          "48042",
          "48044",
          "48045",
          "48067",
          "48069",
          "48072",
          "48073",
          "48076",
          "48082",
          "48088",
          "48093",
          "48097",
          "48098",
          "48103",
          "48104",
          "48105",
          "48114",
          "48135",
          "48138",
          "48140",
          "48150",
          "48154",
          "48168",
          "48170",
          "48178",
          "48182",
          "48184",
          "48185",
          "48187",
          "48188",
          "48192",
          "48198",
          "48201",
          "48221",
          "48239",
          "48246",
          "48302",
          "48306",
          "48307",
          "48309",
          "48315",
          "48326",
          "48327",
          "48335",
          "48341",
          "48356",
          "48363",
          "48380",
          "48386",
          "48390",
          "48393",
          "48451",
          "48455",
          "48506",
          "48507",
          "48623",
          "48625",
          "48640",
          "48642",
          "48703",
          "48706",
          "48740",
          "48761",
          "48808",
          "48823",
          "48844",
          "48854",
          "48858",
          "48875",
          "48912",
          "48917",
          "49001",
          "49006",
          "49007",
          "49008",
          "49014",
          "49015",
          "49024",
          "49042",
          "49046",
          "49048",
          "49058",
          "49080",
          "49085",
          "49088",
          "49093",
          "49111",
          "49117",
          "49120",
          "4915",
          "4920",
          "49201",
          "49224",
          "49245",
          "49269",
          "49301",
          "49302",
          "49307",
          "49316",
          "49319",
          "49323",
          "49333",
          "49341",
          "49345",
          "49417",
          "49424",
          "49426",
          "49441",
          "49453",
          "49503",
          "49504",
          "49505",
          "49506",
          "49507",
          "49508",
          "49525",
          "49544",
          "49601",
          "49615",
          "49646",
          "49684",
          "49685",
          "49770",
          "49783",
          "49855",
          "49876",
          "49880",
          "49931",
          "49938",
          "50021",
          "50125",
          "50161",
          "50219",
          "50255",
          "50265",
          "50266",
          "50315",
          "50317",
          "50320",
          "50321",
          "50438",
          "50501",
          "5055",
          "50554",
          "50588",
          "5059",
          "5060",
          "50701",
          "50801",
          "50849",
          "51051",
          "51142",
          "51401",
          "520",
          "52057",
          "52172",
          "52240",
          "52302",
          "52320",
          "52403",
          "52404",
          "52405",
          "52411",
          "52601",
          "52722",
          "52748",
          "52776",
          "52803",
          "52807",
          "53005",
          "53012",
          "53051",
          "53066",
          "53070",
          "53073",
          "53074",
          "53081",
          "53092",
          "53097",
          "53105",
          "53110",
          "53129",
          "53140",
          "53142",
          "53144",
          "53151",
          "53153",
          "53154",
          "53172",
          "53184",
          "53188",
          "53189",
          "53190",
          "53202",
          "53203",
          "53204",
          "53207",
          "53212",
          "53215",
          "53216",
          "53217",
          "53221",
          "53224",
          "53233",
          "53403",
          "53502",
          "53511",
          "53530",
          "53534",
          "53546",
          "53548",
          "53549",
          "53561",
          "53562",
          "53575",
          "53589",
          "53593",
          "53598",
          "53703",
          "53704",
          "53711",
          "53715",
          "53717",
          "53818",
          "53937",
          "53948",
          "53959",
          "54009",
          "54141",
          "54170",
          "54220",
          "54235",
          "54313",
          "544",
          "54403",
          "54481",
          "54517",
          "5452",
          "54534",
          "5454",
          "54547",
          "54562",
          "54603",
          "54636",
          "54650",
          "5468",
          "54701",
          "54720",
          "54724",
          "54729",
          "5478",
          "5482",
          "54849",
          "54880",
          "54891",
          "54911",
          "54914",
          "54937",
          "5495",
          "54956",
          "54961",
          "54970",
          "55008",
          "55009",
          "55013",
          "55016",
          "55021",
          "55024",
          "55033",
          "55046",
          "55051",
          "55066",
          "55075",
          "55077",
          "55079",
          "55082",
          "55101",
          "55102",
          "55103",
          "55104",
          "55105",
          "55106",
          "55110",
          "55112",
          "55113",
          "55116",
          "55117",
          "55120",
          "55122",
          "55123",
          "55124",
          "55301",
          "55303",
          "55304",
          "55305",
          "55318",
          "55327",
          "55337",
          "55347",
          "55352",
          "55359",
          "55364",
          "55373",
          "55378",
          "55387",
          "55398",
          "55403",
          "55406",
          "55407",
          "55408",
          "55409",
          "55410",
          "55411",
          "55412",
          "55416",
          "55418",
          "55419",
          "55420",
          "55421",
          "55425",
          "55426",
          "55427",
          "55431",
          "55432",
          "55434",
          "55438",
          "55439",
          "55444",
          "55447",
          "55449",
          "55455",
          "55474",
          "55731",
          "55792",
          "55803",
          "55805",
          "55812",
          "55901",
          "55902",
          "55904",
          "55912",
          "55923",
          "55944",
          "55946",
          "56001",
          "56124",
          "56201",
          "56215",
          "56265",
          "56297",
          "56301",
          "56309",
          "56320",
          "56377",
          "56385",
          "56502",
          "56537",
          "56601",
          "5663",
          "57005",
          "57078",
          "57103",
          "57104",
          "57105",
          "57108",
          "57384",
          "57401",
          "5770",
          "57701",
          "57702",
          "58102",
          "58103",
          "58201",
          "58203",
          "58504",
          "58554",
          "58701",
          "59101",
          "59105",
          "59106",
          "59405",
          "59453",
          "59474",
          "59601",
          "59634",
          "59701",
          "59711",
          "59715",
          "59718",
          "59801",
          "59803",
          "59808",
          "59840",
          "59860",
          "59901",
          "59964",
          "60001",
          "60004",
          "60007",
          "60008",
          "60010",
          "60014",
          "60015",
          "60016",
          "60018",
          "60020",
          "60025",
          "60030",
          "60031",
          "60046",
          "60048",
          "60050",
          "60053",
          "60056",
          "60061",
          "60062",
          "60067",
          "60068",
          "60076",
          "60090",
          "60098",
          "60099",
          "60102",
          "60103",
          "60107",
          "60115",
          "60123",
          "60126",
          "6013",
          "60130",
          "60131",
          "60133",
          "60134",
          "60135",
          "60136",
          "60137",
          "60140",
          "60148",
          "6016",
          "60169",
          "60172",
          "60174",
          "60177",
          "60178",
          "60187",
          "60189",
          "60193",
          "60194",
          "60201",
          "60202",
          "6029",
          "60302",
          "60304",
          "60305",
          "6037",
          "6042",
          "60429",
          "60430",
          "60435",
          "60439",
          "60445",
          "60446",
          "60453",
          "60467",
          "60473",
          "60477",
          "60516",
          "60517",
          "60527",
          "60540",
          "60543",
          "60554",
          "60558",
          "60563",
          "60564",
          "60586",
          "60601",
          "60603",
          "60605",
          "60607",
          "60610",
          "60613",
          "60614",
          "60615",
          "60618",
          "60620",
          "60622",
          "60625",
          "60626",
          "60628",
          "60629",
          "60630",
          "60632",
          "60634",
          "60637",
          "60640",
          "60641",
          "60642",
          "60647",
          "60654",
          "60657",
          "60660",
          "60803",
          "60901",
          "61016",
          "61021",
          "61048",
          "61080",
          "61081",
          "61102",
          "61107",
          "61109",
          "6112",
          "61201",
          "61254",
          "61301",
          "61422",
          "61526",
          "61530",
          "61536",
          "61550",
          "61565",
          "61614",
          "61615",
          "61701",
          "61704",
          "61720",
          "61821",
          "61822",
          "61874",
          "61944",
          "62002",
          "62056",
          "62088",
          "62223",
          "62226",
          "62262",
          "62269",
          "62305",
          "62363",
          "62401",
          "62454",
          "62629",
          "6269",
          "62702",
          "62703",
          "62704",
          "62707",
          "62816",
          "62864",
          "62901",
          "62951",
          "62988",
          "63005",
          "63010",
          "63011",
          "63017",
          "63038",
          "63049",
          "63084",
          "63090",
          "63101",
          "63102",
          "63105",
          "63108",
          "63114",
          "63122",
          "63123",
          "63126",
          "63128",
          "63132",
          "63139",
          "63141",
          "63304",
          "63348",
          "63366",
          "63367",
          "63368",
          "63376",
          "63385",
          "63401",
          "63461",
          "63755",
          "64014",
          "64030",
          "64060",
          "64063",
          "64086",
          "64098",
          "6410",
          "64105",
          "64111",
          "64114",
          "64117",
          "64118",
          "64151",
          "64154",
          "64163",
          "6418",
          "64468",
          "64506",
          "6460",
          "64624",
          "64772",
          "64776",
          "64801",
          "64804",
          "64836",
          "65079",
          "6514",
          "6517",
          "65201",
          "65202",
          "65203",
          "65233",
          "65240",
          "65251",
          "65305",
          "65355",
          "65486",
          "65542",
          "65608",
          "65616",
          "65704",
          "65734",
          "65753",
          "65758",
          "65759",
          "65802",
          "65804",
          "65807",
          "66002",
          "66030",
          "66045",
          "66048",
          "66053",
          "66061",
          "66062",
          "6611",
          "66111",
          "66112",
          "66206",
          "66207",
          "66209",
          "66210",
          "66213",
          "66219",
          "66427",
          "66436",
          "66441",
          "66512",
          "66614",
          "66801",
          "66935",
          "67010",
          "67022",
          "67026",
          "67060",
          "67204",
          "67210",
          "67211",
          "67401",
          "67502",
          "67530",
          "67543",
          "67561",
          "6770",
          "67701",
          "67735",
          "6801",
          "68025",
          "68045",
          "68048",
          "68106",
          "68128",
          "68130",
          "68134",
          "68135",
          "68136",
          "68154",
          "68164",
          "68433",
          "6850",
          "68502",
          "68505",
          "68506",
          "68507",
          "6851",
          "68510",
          "68516",
          "6854",
          "68725",
          "6877",
          "68801",
          "68850",
          "68920",
          "69301",
          "6951",
          "69565",
          "70001",
          "70124",
          "70131",
          "7017",
          "7036",
          "70431",
          "70437",
          "70508",
          "70605",
          "7065",
          "7076",
          "70785",
          "70808",
          "71049",
          "71275",
          "71603",
          "71832",
          "71835",
          "71901",
          "71909",
          "71913",
          "72012",
          "72015",
          "72032",
          "72034",
          "72036",
          "72120",
          "72202",
          "72205",
          "72210",
          "72335",
          "72404",
          "72683",
          "72701",
          "72703",
          "727764",
          "72802",
          "72837",
          "72903",
          "72956",
          "73003",
          "73008",
          "73013",
          "73034",
          "73043",
          "73044",
          "73068",
          "7307",
          "73071",
          "73072",
          "73084",
          "73104",
          "73109",
          "73120",
          "73139",
          "73141",
          "73159",
          "73160",
          "73401",
          "73439",
          "73507",
          "73632",
          "73703",
          "73750",
          "74006",
          "74017",
          "74019",
          "74055",
          "74063",
          "74070",
          "74074",
          "74104",
          "74105",
          "74120",
          "74129",
          "74133",
          "74135",
          "74136",
          "74401",
          "74429",
          "74480",
          "74743",
          "7480",
          "74801",
          "74834",
          "74962",
          "75032",
          "75043",
          "75044",
          "75062",
          "75098",
          "75104",
          "75115",
          "75135",
          "75234",
          "75238",
          "75244",
          "75601",
          "75686",
          "75703",
          "75925",
          "7601",
          "76010",
          "76014",
          "76018",
          "7605",
          "76051",
          "76063",
          "76087",
          "76126",
          "76262",
          "76354",
          "76365",
          "76502",
          "76528",
          "76541",
          "7676",
          "77007",
          "77054",
          "77056",
          "77071",
          "77073",
          "77077",
          "77079",
          "77080",
          "77084",
          "77089",
          "77090",
          "77099",
          "7726",
          "7727",
          "77304",
          "7731",
          "77318",
          "77345",
          "773454",
          "77355",
          "77372",
          "77399",
          "77447",
          "7753",
          "77566",
          "77803",
          "77876",
          "78015",
          "78024",
          "78028",
          "78209",
          "78233",
          "78249",
          "78654",
          "78665",
          "78704",
          "78722",
          "78739",
          "78746",
          "78748",
          "78749",
          "78750",
          "7940",
          "79416",
          "79424",
          "7960",
          "79602",
          "79701",
          "7974",
          "79762",
          "79904",
          "79912",
          "79913",
          "79928",
          "79938",
          "80002",
          "80003",
          "80005",
          "80011",
          "80013",
          "80015",
          "80018",
          "80020",
          "80021",
          "80026",
          "80031",
          "80033",
          "80104",
          "80108",
          "80111",
          "80112",
          "80113",
          "80122",
          "80123",
          "80127",
          "80138",
          "80202",
          "80203",
          "80204",
          "80205",
          "8021",
          "80210",
          "80211",
          "80214",
          "80218",
          "80223",
          "80224",
          "80226",
          "80228",
          "80231",
          "80236",
          "80237",
          "80247",
          "80249",
          "80301",
          "80302",
          "80303",
          "80401",
          "80421",
          "80424",
          "80447",
          "80482",
          "80501",
          "80504",
          "80513",
          "80524",
          "80525",
          "8053",
          "80537",
          "80631",
          "80634",
          "80831",
          "8087",
          "80903",
          "80906",
          "80907",
          "80908",
          "80918",
          "80922",
          "80923",
          "81007",
          "81050",
          "81125",
          "81131",
          "81147",
          "81252",
          "81303",
          "81321",
          "81501",
          "81507",
          "81620",
          "81623",
          "81652",
          "82009",
          "82082",
          "82435",
          "82716",
          "82718",
          "82939",
          "83201",
          "8340",
          "83501",
          "83644",
          "83646",
          "83709",
          "83713",
          "84037",
          "84088",
          "84095",
          "84096",
          "84106",
          "84111",
          "84119",
          "84124",
          "84601",
          "85004",
          "85029",
          "85042",
          "85050",
          "85119",
          "8520",
          "85207",
          "85208",
          "85210",
          "85242",
          "85253",
          "85266",
          "85281",
          "85282",
          "85296",
          "85301",
          "85308",
          "85365",
          "85373",
          "85392",
          "8550",
          "85635",
          "85710",
          "85712",
          "85742",
          "86001",
          "86442",
          "87111",
          "87120",
          "87123",
          "87144",
          "8739",
          "87402",
          "87505",
          "87508",
          "8801",
          "8802",
          "8809",
          "8823",
          "8831",
          "88312",
          "88345",
          "8844",
          "8865",
          "89021",
          "89074",
          "89117",
          "89141",
          "89338",
          "89523",
          "90018",
          "90020",
          "90034",
          "90036",
          "90056",
          "90242",
          "90245",
          "90250",
          "90505",
          "90601",
          "90713",
          "90803",
          "91001",
          "91040",
          "91304",
          "91320",
          "91350",
          "91356",
          "91406",
          "91601",
          "91604",
          "91702",
          "91710",
          "91722",
          "91730",
          "91739",
          "91740",
          "91750",
          "91792",
          "91941",
          "91942",
          "91950",
          "92009",
          "92020",
          "92021",
          "92024",
          "92026",
          "92028",
          "92036",
          "92083",
          "92103",
          "92104",
          "92105",
          "92107",
          "92108",
          "92115",
          "92117",
          "92122",
          "92123",
          "92126",
          "92128",
          "92130",
          "92131",
          "92223",
          "92253",
          "92260",
          "92324",
          "92345",
          "92359",
          "92392",
          "92618",
          "92629",
          "92630",
          "92683",
          "92706",
          "92708",
          "92782",
          "92887",
          "93001",
          "93063",
          "93292",
          "93401",
          "93410",
          "93422",
          "93436",
          "93454",
          "93455",
          "93523",
          "93534",
          "93602",
          "93711",
          "93831",
          "93940",
          "94025",
          "94037",
          "94040",
          "94044",
          "94085",
          "94114",
          "94121",
          "94129",
          "94526",
          "94531",
          "94533",
          "94544",
          "94550",
          "94553",
          "94566",
          "94580",
          "94588",
          "94597",
          "94609",
          "94611",
          "94613",
          "94706",
          "94708",
          "94806",
          "94949",
          "95014",
          "95018",
          "95023",
          "95060",
          "95070",
          "95076",
          "95116",
          "95132",
          "95207",
          "95219",
          "95336",
          "95340",
          "95368",
          "95370",
          "95409",
          "95426",
          "95472",
          "95482",
          "95501",
          "95521",
          "95531",
          "95608",
          "95610",
          "95616",
          "95634",
          "95641",
          "95695",
          "95709",
          "95747",
          "95758",
          "95819",
          "95822",
          "96161",
          "96734",
          "96744",
          "96753",
          "96789",
          "96814",
          "96816",
          "96818",
          "97006",
          "97007",
          "97056",
          "97062",
          "97080",
          "97132",
          "97140",
          "97201",
          "97202",
          "97206",
          "97211",
          "97214",
          "97216",
          "97223",
          "97224",
          "97301",
          "97302",
          "97306",
          "97321",
          "97330",
          "97402",
          "97501",
          "97502",
          "97520",
          "97525",
          "97701",
          "97702",
          "97741",
          "97754",
          "97756",
          "97760",
          "97801",
          "97862",
          "97914",
          "98021",
          "98027",
          "98031",
          "98033",
          "98040",
          "98042",
          "98052",
          "98058",
          "98070",
          "98087",
          "98101",
          "98102",
          "98107",
          "98115",
          "98119",
          "98144",
          "98225",
          "98226",
          "98248",
          "98272",
          "98290",
          "98296",
          "98329",
          "98337",
          "98375",
          "98501",
          "98524",
          "98632",
          "98648",
          "98656",
          "98663",
          "98665",
          "98908",
          "99016",
          "99114",
          "99336",
          "99507",
          "99517",
          "99709",
          "99801"
        ],
        "number_of_missing_values": "261"
      },
      {
        "data_type": "nominal",
        "index": "23",
        "is_ignore": "false",
        "is_row_identifier": "false",
        "is_target": "false",
        "name": "Gender",
        "nominal_value": [
          "Female",
          "Male"
        ],
        "number_of_missing_values": "275"
      },
      {
        "data_type": "nominal",
        "index": "24",
        "is_ignore": "false",
        "is_row_identifier": "false",
        "is_target": "false",
        "name": "Age",
        "nominal_value": [
          "18-29",
          "30-44",
          "45-60",
          "> 60"
        ],
        "number_of_missing_values": "275"
      },
      {
        "data_type": "nominal",
        "index": "25",
        "is_ignore": "false",
        "is_row_identifier": "false",
        "is_target": "false",
        "name": "Household_Income",
        "nominal_value": [
          "$0 - $24,999",
          "$100,000 - $149,999",
          "$150,000+",
          "$25,000 - $49,999",
          "$50,000 - $99,999"
        ],
        "number_of_missing_values": "343"
      },
      {
        "data_type": "nominal",
        "index": "26",
        "is_ignore": "false",
        "is_row_identifier": "false",
        "is_target": "false",
        "name": "Education",
        "nominal_value": [
          "Associate or bachelor degree",
          "Graduate degree",
          "High school degree",
          "Less than high school degree",
          "Some college"
        ],
        "number_of_missing_values": "305"
      },
      {
        "data_type": "nominal",
        "index": "27",
        "is_ignore": "false",
        "is_row_identifier": "false",
        "is_target": "true",
        "name": "Location_(Census_Region)",
        "nominal_value": [
          "East North Central",
          "East South Central",
          "Middle Atlantic",
          "Mountain",
          "New England",
          "Pacific",
          "South Atlantic",
          "West North Central",
          "West South Central"
        ],
        "number_of_missing_values": "284"
      }
    ]
  }
}