{
  "data_set_description": {
    "citation": "Patricio Cerda, Gael Varoquaux, Balazs Kegl. Similarity encoding for learning with dirty categorical variables. 2018. Machine Learning journal, Springer.",
    "collection_date": "29-04-2014",
    "creator": "FiveThirtyEight",
    "default_target_attribute": "Location_(Census_Region)",
    "description": "The midwest survey dataset contain individual responses from surveys about regional identification conducted for FiveThirtyEight by SurveyMonkey.",
    "description_version": "1",
    "file_id": "21854494",
    "format": "arff",
    "id": "42532",
    "language": "English",
    "licence": "Public",
    "md5_checksum": "c410aad98ed8377784157c1418b4575a",
    "minio_url": "https://data.openml.org/datasets/0004/42532/dataset_42532.pq",
    "name": "Midwest_Survey_nominal",
    "original_data_url": "https://github.com/fivethirtyeight/data/tree/master/region-survey",
    "parquet_url": "https://data.openml.org/datasets/0004/42532/dataset_42532.pq",
    "processing_date": "2020-06-19 01:02:03",
    "status": "active",
    "upload_date": "2020-06-19T00:56:36",
    "url": "https://api.openml.org/data/v1/download/21854494/Midwest_Survey_nominal.arff",
    "version": "1",
    "visibility": "public"
  }
}