{
  "data_set_description": {
    "citation": "RM",
    "collection_date": "06-16-202",
    "creator": "Robert Marincu",
    "default_target_attribute": "Survived",
    "description": "This is a test dataset",
    "file_id": "21854462",
    "format": "arff",
    "id": "42522",
    "language": "English",
    "licence": "Public",
    "md5_checksum": "ecc916ed28fb85395fa228417c1a63b6",
    "name": "test",
    "processing_date": "2020-06-16 18:10:03",
    "status": "active",
    "upload_date": "2020-06-16T18:09:40",
    "url": "https://www.openml.org/data/v1/download/21854462/test.arff",
    "version": "13",
    "version_label": "example",
    "visibility": "public"
  }
}