{
  "data_set_description": {
    "creator": [
      "Martin Binder",
      "Florian Pfisterer",
      "Bernd Bischl"
    ],
    "default_target_attribute": "perf.mmce,perf.logloss",
    "description": "Experiment data obtained by running random configurations of xgboost through mlr on 118 different classification tasks from openml.\nParameter descriptions: https://xgboost.readthedocs.io/en/latest/parameter.html",
    "description_version": "1",
    "file_id": "21854257",
    "format": "ARFF",
    "id": "42459",
    "licence": "CC_BY-SA",
    "md5_checksum": "ceffda08d1f32123da7d6027c62f8c69",
    "minio_url": "https://data.openml.org/datasets/0004/42459/dataset_42459.pq",
    "name": "mlr_xgboost_rng",
    "parquet_url": "https://data.openml.org/datasets/0004/42459/dataset_42459.pq",
    "processing_date": "2020-05-23 00:35:23",
    "status": "active",
    "upload_date": "2020-05-23T00:33:14",
    "url": "https://api.openml.org/data/v1/download/21854257/mlr_xgboost_rng.arff",
    "version": "1",
    "visibility": "public"
  }
}