{
  "data_set_description": {
    "creator": [
      "Martin Binder",
      "Florian Pfisterer",
      "Bernd Bischl"
    ],
    "default_target_attribute": "perf.mmce,perf.logloss",
    "description": "Experiment data obtained by running random configurations of the hnsw kNN through mlr on 116 different classification tasks from openml.",
    "description_version": "1",
    "file_id": "21854252",
    "format": "ARFF",
    "id": "42454",
    "licence": "CC_BY-SA",
    "md5_checksum": "30e1ef9ace13803878cf8ddc3cb754a0",
    "minio_url": "https://data.openml.org/datasets/0004/42454/dataset_42454.pq",
    "name": "mlr_knn_rng",
    "parquet_url": "https://data.openml.org/datasets/0004/42454/dataset_42454.pq",
    "processing_date": "2020-05-22 23:44:05",
    "status": "active",
    "upload_date": "2020-05-22T23:43:36",
    "url": "https://api.openml.org/data/v1/download/21854252/mlr_knn_rng.arff",
    "version": "1",
    "visibility": "public"
  }
}