{
  "data_features": {
    "feature": [
      {
        "data_type": "nominal",
        "index": "0",
        "is_ignore": "false",
        "is_row_identifier": "false",
        "is_target": "false",
        "name": "top-left-square",
        "nominal_value": [
          "b",
          "o",
          "x"
        ],
        "number_of_missing_values": "0"
      },
      {
        "data_type": "nominal",
        "index": "1",
        "is_ignore": "false",
        "is_row_identifier": "false",
        "is_target": "false",
        "name": "top-middle-square",
        "nominal_value": [
          "b",
          "o",
          "x"
        ],
        "number_of_missing_values": "0"
      },
      {
        "data_type": "nominal",
        "index": "2",
        "is_ignore": "false",
        "is_row_identifier": "false",
        "is_target": "false",
        "name": "top-right-square",
        "nominal_value": [
          "b",
          "o",
          "x"
        ],
        "number_of_missing_values": "0"
      },
      {
        "data_type": "nominal",
        "index": "3",
        "is_ignore": "false",
        "is_row_identifier": "false",
        "is_target": "false",
        "name": "middle-left-square",
        "nominal_value": [
          "b",
          "o",
          "x"
        ],
        "number_of_missing_values": "0"
      },
      {
        "data_type": "nominal",
        "index": "4",
        "is_ignore": "false",
        "is_row_identifier": "false",
        "is_target": "false",
        "name": "middle-middle-square",
        "nominal_value": [
          "b",
          "o",
          "x"
        ],
        "number_of_missing_values": "0"
      },
      {
        "data_type": "nominal",
        "index": "5",
        "is_ignore": "false",
        "is_row_identifier": "false",
        "is_target": "false",
        "name": "middle-right-square",
        "nominal_value": [
          "b",
          "o",
          "x"
        ],
        "number_of_missing_values": "0"
      },
      {
        "data_type": "nominal",
        "index": "6",
        "is_ignore": "false",
        "is_row_identifier": "false",
        "is_target": "false",
        "name": "bottom-left-square",
        "nominal_value": [
          "b",
          "o",
          "x"
        ],
        "number_of_missing_values": "0"
      },
      {
        "data_type": "nominal",
        "index": "7",
        "is_ignore": "false",
        "is_row_identifier": "false",
        "is_target": "false",
        "name": "bottom-middle-square",
        "nominal_value": [
          "b",
          "o",
          "x"
        ],
        "number_of_missing_values": "0"
      },
      {
        "data_type": "nominal",
        "index": "8",
        "is_ignore": "false",
        "is_row_identifier": "false",
        "is_target": "false",
        "name": "bottom-right-square",
        "nominal_value": [
          "b",
          "o",
          "x"
        ],
        "number_of_missing_values": "0"
      },
      {
        "data_type": "nominal",
        "index": "9",
        "is_ignore": "false",
        "is_row_identifier": "false",
        "is_target": "false",
        "name": "Class",
        "nominal_value": [
          "negative",
          "positive"
        ],
        "number_of_missing_values": "0"
      }
    ]
  }
}