{
  "data_set_description": {
    "default_target_attribute": "price",
    "description": "price col is int now. autoHorse dataset",
    "description_version": "1",
    "file_id": "21791945",
    "format": "ARFF",
    "id": "42224",
    "licence": "CC0",
    "md5_checksum": "7f754c4de468b484906729fcaea06c3b",
    "minio_url": "https://data.openml.org/datasets/0004/42224/dataset_42224.pq",
    "name": "dataset-autoHorse_fixed",
    "parquet_url": "https://data.openml.org/datasets/0004/42224/dataset_42224.pq",
    "processing_date": "2019-12-18 22:31:03",
    "status": "active",
    "upload_date": "2019-12-18T22:30:03",
    "url": "https://api.openml.org/data/v1/download/21791945/dataset-autoHorse_fixed.arff",
    "version": "2",
    "version_label": "0.2",
    "visibility": "public"
  }
}