{
  "data_features": {
    "feature": {
      "data_type": "nominal",
      "index": "0",
      "is_ignore": "false",
      "is_row_identifier": "false",
      "is_target": "false",
      "name": "frameindex;frametime;pcm_logenergy",
      "nominal_value": [
        "0;0.000000;-2.210641e+01",
        "100;1.000000;-6.211808e+00",
        "101;1.010000;-6.445584e+00",
        "102;1.020000;-6.538151e+00",
        "103;1.030000;-6.843467e+00",
        "104;1.040000;-7.074826e+00",
        "105;1.050000;-7.242393e+00",
        "106;1.060000;-6.500566e+00",
        "107;1.070000;-6.498928e+00",
        "108;1.080000;-6.757102e+00",
        "109;1.090000;-7.108596e+00",
        "10;0.100000;-2.217432e+01",
        "110;1.100000;-7.330196e+00",
        "111;1.110000;-7.735678e+00",
        "112;1.120000;-8.388123e+00",
        "113;1.130000;-7.968114e+00",
        "114;1.140000;-7.735401e+00",
        "115;1.150000;-8.100832e+00",
        "116;1.160000;-8.481040e+00",
        "117;1.170000;-8.474930e+00",
        "118;1.180000;-8.477726e+00",
        "119;1.190000;-8.657585e+00",
        "11;0.110000;-2.221196e+01",
        "120;1.200000;-8.235514e+00",
        "121;1.210000;-7.912922e+00",
        "122;1.220000;-8.436689e+00",
        "123;1.230000;-9.323907e+00",
        "124;1.240000;-9.030853e+00",
        "125;1.250000;-8.806360e+00",
        "126;1.260000;-9.161111e+00",
        "127;1.270000;-9.838111e+00",
        "128;1.280000;-9.649776e+00",
        "129;1.290000;-9.771181e+00",
        "12;0.120000;-2.217884e+01",
        "130;1.300000;-9.959004e+00",
        "131;1.310000;-9.924535e+00",
        "132;1.320000;-9.963263e+00",
        "133;1.330000;-1.037324e+01",
        "134;1.340000;-1.076848e+01",
        "135;1.350000;-1.097598e+01",
        "136;1.360000;-1.089849e+01",
        "137;1.370000;-1.073162e+01",
        "138;1.380000;-1.096232e+01",
        "139;1.390000;-1.133238e+01",
        "13;0.130000;-2.174629e+01",
        "140;1.400000;-1.216191e+01",
        "141;1.410000;-1.179442e+01",
        "142;1.420000;-1.175629e+01",
        "143;1.430000;-1.175973e+01",
        "144;1.440000;-1.155401e+01",
        "145;1.450000;-1.185268e+01",
        "146;1.460000;-1.172946e+01",
        "147;1.470000;-1.137848e+01",
        "148;1.480000;-1.126642e+01",
        "149;1.490000;-1.170522e+01",
        "14;0.140000;-2.187991e+01",
        "150;1.500000;-1.214197e+01",
        "151;1.510000;-1.175461e+01",
        "152;1.520000;-1.172775e+01",
        "153;1.530000;-1.185289e+01",
        "154;1.540000;-1.224301e+01",
        "155;1.550000;-1.222343e+01",
        "156;1.560000;-1.263706e+01",
        "157;1.570000;-1.341820e+01",
        "158;1.580000;-1.325680e+01",
        "159;1.590000;-1.323445e+01",
        "15;0.150000;-2.173752e+01",
        "160;1.600000;-1.279807e+01",
        "161;1.610000;-1.253392e+01",
        "162;1.620000;-1.271981e+01",
        "163;1.630000;-1.347142e+01",
        "164;1.640000;-1.347300e+01",
        "165;1.650000;-1.311436e+01",
        "166;1.660000;-1.315734e+01",
        "167;1.670000;-1.325385e+01",
        "168;1.680000;-1.386275e+01",
        "169;1.690000;-1.449050e+01",
        "16;0.160000;-2.210725e+01",
        "170;1.700000;-1.366611e+01",
        "171;1.710000;-1.363214e+01",
        "172;1.720000;-1.401586e+01",
        "173;1.730000;-1.471660e+01",
        "174;1.740000;-1.423848e+01",
        "175;1.750000;-1.363435e+01",
        "176;1.760000;-1.369370e+01",
        "177;1.770000;-1.358130e+01",
        "178;1.780000;-1.385109e+01",
        "179;1.790000;-1.435756e+01",
        "17;0.170000;-2.173404e+01",
        "180;1.800000;-1.552609e+01",
        "181;1.810000;-1.564533e+01",
        "182;1.820000;-1.486005e+01",
        "183;1.830000;-1.502119e+01",
        "184;1.840000;-1.477801e+01",
        "185;1.850000;-1.525593e+01",
        "186;1.860000;-1.571078e+01",
        "187;1.870000;-1.463307e+01",
        "188;1.880000;-1.459201e+01",
        "189;1.890000;-1.487022e+01",
        "18;0.180000;-2.070218e+01",
        "190;1.900000;-1.517964e+01",
        "191;1.910000;-1.578195e+01",
        "192;1.920000;-1.544190e+01",
        "193;1.930000;-1.561320e+01",
        "194;1.940000;-1.554658e+01",
        "195;1.950000;-1.488615e+01",
        "196;1.960000;-1.464323e+01",
        "197;1.970000;-1.490836e+01",
        "198;1.980000;-1.583552e+01",
        "199;1.990000;-1.704301e+01",
        "19;0.190000;-1.766744e+01",
        "1;0.010000;-2.188192e+01",
        "200;2.000000;-4.158871e+01",
        "201;2.010000;-4.158871e+01",
        "202;2.020000;-4.158871e+01",
        "203;2.030000;-4.158871e+01",
        "204;2.040000;-4.158871e+01",
        "205;2.050000;-4.158871e+01",
        "206;2.060000;-4.158871e+01",
        "207;2.070000;-4.158871e+01",
        "208;2.080000;-4.158871e+01",
        "209;2.090000;-4.158871e+01",
        "20;0.200000;-1.490449e+01",
        "210;2.100000;-4.158871e+01",
        "211;2.110000;-4.158871e+01",
        "212;2.120000;-4.158871e+01",
        "213;2.130000;-4.158871e+01",
        "214;2.140000;-4.158871e+01",
        "215;2.150000;-4.158871e+01",
        "216;2.160000;-4.158871e+01",
        "217;2.170000;-4.158871e+01",
        "218;2.180000;-4.158871e+01",
        "219;2.190000;-4.158871e+01",
        "21;0.210000;-1.228860e+01",
        "220;2.200000;-4.158871e+01",
        "22;0.220000;-1.081285e+01",
        "23;0.230000;-9.547049e+00",
        "24;0.240000;-8.712064e+00",
        "25;0.250000;-7.976728e+00",
        "26;0.260000;-7.330282e+00",
        "27;0.270000;-6.954174e+00",
        "28;0.280000;-6.494974e+00",
        "29;0.290000;-6.521528e+00",
        "2;0.020000;-2.170770e+01",
        "30;0.300000;-5.991194e+00",
        "31;0.310000;-5.505110e+00",
        "32;0.320000;-5.357806e+00",
        "33;0.330000;-4.929784e+00",
        "34;0.340000;-4.199017e+00",
        "35;0.350000;-3.948685e+00",
        "36;0.360000;-3.920963e+00",
        "37;0.370000;-4.280830e+00",
        "38;0.380000;-3.150297e+00",
        "39;0.390000;-2.767552e+00",
        "3;0.030000;-2.202792e+01",
        "40;0.400000;-2.153783e+00",
        "41;0.410000;-1.855697e+00",
        "42;0.420000;-1.641014e+00",
        "43;0.430000;-1.820198e+00",
        "44;0.440000;-1.906710e+00",
        "45;0.450000;-1.883492e+00",
        "46;0.460000;-1.511823e+00",
        "47;0.470000;-1.489898e+00",
        "48;0.480000;-1.579073e+00",
        "49;0.490000;-1.304555e+00",
        "4;0.040000;-2.196314e+01",
        "50;0.500000;-1.164213e+00",
        "51;0.510000;-1.243890e+00",
        "52;0.520000;-1.510638e+00",
        "53;0.530000;-1.128978e+00",
        "54;0.540000;-8.808784e-01",
        "55;0.550000;-9.970153e-01",
        "56;0.560000;-1.113052e+00",
        "57;0.570000;-1.827388e+00",
        "58;0.580000;-2.013073e+00",
        "59;0.590000;-2.084962e+00",
        "5;0.050000;-2.200181e+01",
        "60;0.600000;-2.121398e+00",
        "61;0.610000;-2.123875e+00",
        "62;0.620000;-2.049622e+00",
        "63;0.630000;-2.286173e+00",
        "64;0.640000;-2.361617e+00",
        "65;0.650000;-2.398100e+00",
        "66;0.660000;-2.879223e+00",
        "67;0.670000;-3.593151e+00",
        "68;0.680000;-4.316636e+00",
        "69;0.690000;-4.807490e+00",
        "6;0.060000;-2.214415e+01",
        "70;0.700000;-5.537949e+00",
        "71;0.710000;-5.892782e+00",
        "72;0.720000;-5.098394e+00",
        "73;0.730000;-4.691539e+00",
        "74;0.740000;-5.013942e+00",
        "75;0.750000;-5.346075e+00",
        "76;0.760000;-6.653904e+00",
        "77;0.770000;-6.748954e+00",
        "78;0.780000;-7.053837e+00",
        "79;0.790000;-6.989598e+00",
        "7;0.070000;-2.192031e+01",
        "80;0.800000;-6.629791e+00",
        "81;0.810000;-5.462476e+00",
        "82;0.820000;-5.352750e+00",
        "83;0.830000;-5.854526e+00",
        "84;0.840000;-6.090071e+00",
        "85;0.850000;-5.057469e+00",
        "86;0.860000;-4.747969e+00",
        "87;0.870000;-5.112229e+00",
        "88;0.880000;-5.860878e+00",
        "89;0.890000;-5.390118e+00",
        "8;0.080000;-2.190781e+01",
        "90;0.900000;-5.138459e+00",
        "91;0.910000;-5.755834e+00",
        "92;0.920000;-6.158465e+00",
        "93;0.930000;-6.907505e+00",
        "94;0.940000;-6.595597e+00",
        "95;0.950000;-6.288364e+00",
        "96;0.960000;-6.470668e+00",
        "97;0.970000;-6.362008e+00",
        "98;0.980000;-6.763252e+00",
        "99;0.990000;-6.478246e+00",
        "9;0.090000;-2.182633e+01"
      ],
      "number_of_missing_values": "0"
    }
  }
}