{
  "data_set_description": {
    "creator": [
      "Alessio Baccelli",
      "Diego Fiori"
    ],
    "description": "This dataset contains all the player names and player ids, taken from Sofifa",
    "description_version": "1",
    "file_id": "21757047",
    "format": "ARFF",
    "id": "42199",
    "licence": "CC0",
    "md5_checksum": "1a730e82ba502328ec5a09a02d3d0c75",
    "minio_url": "https://data.openml.org/datasets/0004/42199/dataset_42199.pq",
    "name": "Player_names",
    "parquet_url": "https://data.openml.org/datasets/0004/42199/dataset_42199.pq",
    "processing_date": "2019-11-15 17:46:02",
    "status": "active",
    "upload_date": "2019-11-15T17:45:16",
    "url": "https://api.openml.org/data/v1/download/21757047/Player_names.arff",
    "version": "1",
    "version_label": "0.0.1",
    "visibility": "public"
  }
}