{
  "data_qualities": {
    "quality": [
      {
        "name": "AutoCorrelation",
        "value": "0.3991031390134529"
      },
      {
        "name": "ClassEntropy",
        "value": "1.367552313056074"
      },
      {
        "name": "Dimensionality",
        "value": "0.08928571428571429"
      },
      {
        "name": "EquivalentNumberOfAtts",
        "value": "10.841958241004189"
      },
      {
        "name": "MajorityClassPercentage",
        "value": "54.91071428571429"
      },
      {
        "name": "MajorityClassSize",
        "value": "123.0"
      },
      {
        "name": "MaxAttributeEntropy",
        "value": "2.189044597278174"
      },
      {
        "name": "MaxKurtosisOfNumericAtts",
        "value": "220.55589140861554"
      },
      {
        "name": "MaxMeansOfNumericAtts",
        "value": "25.09375"
      },
      {
        "name": "MaxMutualInformation",
        "value": "0.31306444871923"
      },
      {
        "name": "MaxNominalAttDistinctValues",
        "value": "5.0"
      },
      {
        "name": "MaxSkewnessOfNumericAtts",
        "value": "14.795071234753795"
      },
      {
        "name": "MaxStdDevOfNumericAtts",
        "value": "61.47907267617201"
      },
      {
        "name": "MeanAttributeEntropy",
        "value": "1.5020168692500062"
      },
      {
        "name": "MeanKurtosisOfNumericAtts",
        "value": "24.54585636422177"
      },
      {
        "name": "MeanMeansOfNumericAtts",
        "value": "7.604037750805466"
      },
      {
        "name": "MeanMutualInformation",
        "value": "0.126135176197599"
      },
      {
        "name": "MeanNoiseToSignalRatio",
        "value": "10.907993586951498"
      },
      {
        "name": "MeanNominalAttDistinctValues",
        "value": "4.181818181818182"
      },
      {
        "name": "MeanSkewnessOfNumericAtts",
        "value": "2.2575196300999707"
      },
      {
        "name": "MeanStdDevOfNumericAtts",
        "value": "10.84829214994542"
      },
      {
        "name": "MinAttributeEntropy",
        "value": "0.9364375240301192"
      },
      {
        "name": "MinKurtosisOfNumericAtts",
        "value": "-1.2019606544609256"
      },
      {
        "name": "MinMeansOfNumericAtts",
        "value": "0.6261926605504586"
      },
      {
        "name": "MinMutualInformation",
        "value": "0.02763870343695"
      },
      {
        "name": "MinNominalAttDistinctValues",
        "value": "2.0"
      },
      {
        "name": "MinSkewnessOfNumericAtts",
        "value": "0.14523809368931467"
      },
      {
        "name": "MinStdDevOfNumericAtts",
        "value": "0.6901977940916115"
      },
      {
        "name": "MinorityClassPercentage",
        "value": "0.4464285714285714"
      },
      {
        "name": "MinorityClassSize",
        "value": "1.0"
      },
      {
        "name": "NumberOfBinaryFeatures",
        "value": "1.0"
      },
      {
        "name": "NumberOfClasses",
        "value": "6.0"
      },
      {
        "name": "NumberOfFeatures",
        "value": "20.0"
      },
      {
        "name": "NumberOfInstances",
        "value": "224.0"
      },
      {
        "name": "NumberOfInstancesWithMissingValues",
        "value": "143.0"
      },
      {
        "name": "NumberOfMissingValues",
        "value": "205.0"
      },
      {
        "name": "NumberOfNumericFeatures",
        "value": "9.0"
      },
      {
        "name": "NumberOfSymbolicFeatures",
        "value": "11.0"
      },
      {
        "name": "PercentageOfBinaryFeatures",
        "value": "5.0"
      },
      {
        "name": "PercentageOfInstancesWithMissingValues",
        "value": "63.83928571428571"
      },
      {
        "name": "PercentageOfMissingValues",
        "value": "4.575892857142857"
      },
      {
        "name": "PercentageOfNumericFeatures",
        "value": "45.0"
      },
      {
        "name": "PercentageOfSymbolicFeatures",
        "value": "55.00000000000001"
      },
      {
        "name": "Quartile1AttributeEntropy",
        "value": "1.052472130612063"
      },
      {
        "name": "Quartile1KurtosisOfNumericAtts",
        "value": "-0.7665649542233117"
      },
      {
        "name": "Quartile1MeansOfNumericAtts",
        "value": "1.2819607236740376"
      },
      {
        "name": "Quartile1MutualInformation",
        "value": "0.0733739501691325"
      },
      {
        "name": "Quartile1SkewnessOfNumericAtts",
        "value": "0.39388379550539987"
      },
      {
        "name": "Quartile1StdDevOfNumericAtts",
        "value": "0.9347419956085021"
      },
      {
        "name": "Quartile2AttributeEntropy",
        "value": "1.5032924121082274"
      },
      {
        "name": "Quartile2KurtosisOfNumericAtts",
        "value": "-0.3762257218950129"
      },
      {
        "name": "Quartile2MeansOfNumericAtts",
        "value": "3.90625"
      },
      {
        "name": "Quartile2MutualInformation",
        "value": "0.112255933771815"
      },
      {
        "name": "Quartile2SkewnessOfNumericAtts",
        "value": "0.9706476332481853"
      },
      {
        "name": "Quartile2StdDevOfNumericAtts",
        "value": "2.2290722222906143"
      },
      {
        "name": "Quartile3AttributeEntropy",
        "value": "1.8567369089128345"
      },
      {
        "name": "Quartile3KurtosisOfNumericAtts",
        "value": "1.9129758070671805"
      },
      {
        "name": "Quartile3MeansOfNumericAtts",
        "value": "15.003794642857143"
      },
      {
        "name": "Quartile3MutualInformation",
        "value": "0.1566938669528525"
      },
      {
        "name": "Quartile3SkewnessOfNumericAtts",
        "value": "1.037929985438628"
      },
      {
        "name": "Quartile3StdDevOfNumericAtts",
        "value": "13.15416281363094"
      },
      {
        "name": "StdvNominalAttDistinctValues",
        "value": "1.0787197799411874"
      }
    ]
  }
}