{
  "data_qualities": {
    "quality": [
      {
        "name": "AutoCorrelation",
        "value": "0.9998187055576818"
      },
      {
        "name": "ClassEntropy",
        "value": "3.2215954513326905"
      },
      {
        "name": "Dimensionality",
        "value": "0.06190073322053018"
      },
      {
        "name": "EquivalentNumberOfAtts",
        "value": []
      },
      {
        "name": "MajorityClassPercentage",
        "value": "19.095963258399806"
      },
      {
        "name": "MajorityClassSize",
        "value": "9480.0"
      },
      {
        "name": "MaxAttributeEntropy",
        "value": []
      },
      {
        "name": "MaxKurtosisOfNumericAtts",
        "value": "0.1265800948403717"
      },
      {
        "name": "MaxMeansOfNumericAtts",
        "value": "124.13508178229009"
      },
      {
        "name": "MaxMutualInformation",
        "value": []
      },
      {
        "name": "MaxNominalAttDistinctValues",
        "value": "10.0"
      },
      {
        "name": "MaxSkewnessOfNumericAtts",
        "value": "0.5858725981239463"
      },
      {
        "name": "MaxStdDevOfNumericAtts",
        "value": "57.0977057969257"
      },
      {
        "name": "MeanAttributeEntropy",
        "value": []
      },
      {
        "name": "MeanKurtosisOfNumericAtts",
        "value": "-0.4112343323000494"
      },
      {
        "name": "MeanMeansOfNumericAtts",
        "value": "115.65479011997716"
      },
      {
        "name": "MeanMutualInformation",
        "value": []
      },
      {
        "name": "MeanNoiseToSignalRatio",
        "value": []
      },
      {
        "name": "MeanNominalAttDistinctValues",
        "value": "10.0"
      },
      {
        "name": "MeanSkewnessOfNumericAtts",
        "value": "0.34786550643629954"
      },
      {
        "name": "MeanStdDevOfNumericAtts",
        "value": "52.658309993970235"
      },
      {
        "name": "MinAttributeEntropy",
        "value": []
      },
      {
        "name": "MinKurtosisOfNumericAtts",
        "value": "-0.7148094628135562"
      },
      {
        "name": "MinMeansOfNumericAtts",
        "value": "108.866167109822"
      },
      {
        "name": "MinMutualInformation",
        "value": []
      },
      {
        "name": "MinNominalAttDistinctValues",
        "value": "10.0"
      },
      {
        "name": "MinSkewnessOfNumericAtts",
        "value": "0.17520361974125165"
      },
      {
        "name": "MinStdDevOfNumericAtts",
        "value": "46.88121646780846"
      },
      {
        "name": "MinorityClassPercentage",
        "value": "6.298847796309726"
      },
      {
        "name": "MinorityClassSize",
        "value": "3127.0"
      },
      {
        "name": "NumberOfBinaryFeatures",
        "value": "0.0"
      },
      {
        "name": "NumberOfClasses",
        "value": "10.0"
      },
      {
        "name": "NumberOfFeatures",
        "value": "3073.0"
      },
      {
        "name": "NumberOfInstances",
        "value": "49644.0"
      },
      {
        "name": "NumberOfInstancesWithMissingValues",
        "value": "0.0"
      },
      {
        "name": "NumberOfMissingValues",
        "value": "0.0"
      },
      {
        "name": "NumberOfNumericFeatures",
        "value": "3072.0"
      },
      {
        "name": "NumberOfSymbolicFeatures",
        "value": "1.0"
      },
      {
        "name": "PercentageOfBinaryFeatures",
        "value": "0.0"
      },
      {
        "name": "PercentageOfInstancesWithMissingValues",
        "value": "0.0"
      },
      {
        "name": "PercentageOfMissingValues",
        "value": "0.0"
      },
      {
        "name": "PercentageOfNumericFeatures",
        "value": "99.96745850959974"
      },
      {
        "name": "PercentageOfSymbolicFeatures",
        "value": "0.03254149040026033"
      },
      {
        "name": "Quartile1AttributeEntropy",
        "value": []
      },
      {
        "name": "Quartile1KurtosisOfNumericAtts",
        "value": "-0.5181450919201539"
      },
      {
        "name": "Quartile1MeansOfNumericAtts",
        "value": "113.13214587865608"
      },
      {
        "name": "Quartile1MutualInformation",
        "value": []
      },
      {
        "name": "Quartile1SkewnessOfNumericAtts",
        "value": "0.30039248325166645"
      },
      {
        "name": "Quartile1StdDevOfNumericAtts",
        "value": "51.44110691672933"
      },
      {
        "name": "Quartile2AttributeEntropy",
        "value": []
      },
      {
        "name": "Quartile2KurtosisOfNumericAtts",
        "value": "-0.45038568930388645"
      },
      {
        "name": "Quartile2MeansOfNumericAtts",
        "value": "114.09411006365347"
      },
      {
        "name": "Quartile2MutualInformation",
        "value": []
      },
      {
        "name": "Quartile2SkewnessOfNumericAtts",
        "value": "0.3321756993472813"
      },
      {
        "name": "Quartile2StdDevOfNumericAtts",
        "value": "53.23770034414177"
      },
      {
        "name": "Quartile3AttributeEntropy",
        "value": []
      },
      {
        "name": "Quartile3KurtosisOfNumericAtts",
        "value": "-0.3521157007606127"
      },
      {
        "name": "Quartile3MeansOfNumericAtts",
        "value": "119.2417865200225"
      },
      {
        "name": "Quartile3MutualInformation",
        "value": []
      },
      {
        "name": "Quartile3SkewnessOfNumericAtts",
        "value": "0.38434621729015617"
      },
      {
        "name": "Quartile3StdDevOfNumericAtts",
        "value": "53.99866638228181"
      },
      {
        "name": "StdvNominalAttDistinctValues",
        "value": "0.0"
      }
    ]
  }
}