{
  "data_features": {
    "feature": [
      {
        "data_type": "numeric",
        "index": "0",
        "is_ignore": "false",
        "is_row_identifier": "false",
        "is_target": "false",
        "name": "lotnum",
        "number_of_missing_values": "0"
      },
      {
        "data_type": "nominal",
        "index": "1",
        "is_ignore": "false",
        "is_row_identifier": "false",
        "is_target": "false",
        "name": "date",
        "nominal_value": [
          "01/01/2011",
          "01/01/2013",
          "01/01/2019",
          "01/02/2011",
          "01/02/2014",
          "01/02/2018",
          "01/03/2011",
          "01/03/2012",
          "01/03/2014",
          "01/03/2016",
          "01/04/2014",
          "01/04/2017",
          "01/05/2010",
          "01/05/2012",
          "01/05/2016",
          "01/05/2018",
          "01/06/2010",
          "01/06/2013",
          "01/06/2019",
          "01/07/2010",
          "01/07/2014",
          "01/07/2017",
          "01/08/2009",
          "01/08/2015",
          "01/08/2017",
          "01/09/2009",
          "01/09/2012",
          "01/09/2015",
          "01/09/2018",
          "01/10/2013",
          "01/10/2016",
          "01/10/2017",
          "01/11/2011",
          "01/11/2012",
          "01/11/2014",
          "01/11/2016",
          "01/11/2018",
          "01/12/2009",
          "01/12/2012",
          "01/12/2015",
          "01/12/2018",
          "02/01/2010",
          "02/01/2016",
          "02/01/2018",
          "02/02/2010",
          "02/02/2012",
          "02/02/2013",
          "02/02/2016",
          "02/02/2019",
          "02/03/2010",
          "02/03/2013",
          "02/03/2019",
          "02/04/2009",
          "02/04/2011",
          "02/04/2013",
          "02/04/2016",
          "02/04/2019",
          "02/05/2009",
          "02/05/2015",
          "02/06/2009",
          "02/06/2012",
          "02/06/2015",
          "02/06/2018",
          "02/07/2009",
          "02/07/2011",
          "02/07/2013",
          "02/07/2016",
          "02/07/2019",
          "02/08/2011",
          "02/08/2012",
          "02/08/2014",
          "02/08/2016",
          "02/08/2018",
          "02/09/2014",
          "02/09/2017",
          "02/10/2010",
          "02/10/2011",
          "02/10/2012",
          "02/10/2018",
          "02/11/2010",
          "02/11/2013",
          "02/11/2017",
          "02/12/2014",
          "02/12/2017",
          "03/01/2012",
          "03/01/2015",
          "03/01/2017",
          "03/01/2019",
          "03/02/2015",
          "03/02/2018",
          "03/03/2009",
          "03/03/2012",
          "03/03/2015",
          "03/03/2018",
          "03/04/2010",
          "03/04/2012",
          "03/04/2018",
          "03/05/2011",
          "03/05/2012",
          "03/05/2014",
          "03/05/2016",
          "03/05/2017",
          "03/06/2010",
          "03/06/2017",
          "03/07/2010",
          "03/07/2012",
          "03/07/2018",
          "03/08/2010",
          "03/08/2013",
          "03/08/2017",
          "03/08/2019",
          "03/09/2011",
          "03/09/2013",
          "03/09/2016",
          "03/10/2009",
          "03/10/2015",
          "03/10/2017",
          "03/11/2009",
          "03/11/2012",
          "03/11/2015",
          "03/11/2018",
          "03/12/2011",
          "03/12/2013",
          "03/12/2016",
          "04/01/2011",
          "04/01/2014",
          "04/01/2018",
          "04/02/2012",
          "04/02/2014",
          "04/02/2017",
          "04/03/2014",
          "04/03/2017",
          "04/04/2009",
          "04/04/2015",
          "04/04/2017",
          "04/04/2019",
          "04/05/2010",
          "04/05/2013",
          "04/05/2019",
          "04/06/2009",
          "04/06/2011",
          "04/06/2013",
          "04/06/2014",
          "04/06/2016",
          "04/06/2019",
          "04/07/2009",
          "04/07/2015",
          "04/07/2017",
          "04/07/2019",
          "04/08/2009",
          "04/08/2012",
          "04/08/2015",
          "04/08/2018",
          "04/09/2010",
          "04/09/2012",
          "04/09/2018",
          "04/10/2011",
          "04/10/2018",
          "04/11/2014",
          "04/11/2017",
          "04/12/2010",
          "04/12/2012",
          "04/12/2018",
          "05/01/2010",
          "05/01/2012",
          "05/01/2013",
          "05/01/2016",
          "05/01/2019",
          "05/02/2011",
          "05/02/2013",
          "05/02/2019",
          "05/03/2009",
          "05/03/2011",
          "05/03/2013",
          "05/03/2016",
          "05/03/2019",
          "05/04/2011",
          "05/04/2014",
          "05/04/2016",
          "05/05/2009",
          "05/05/2012",
          "05/05/2015",
          "05/05/2018",
          "05/06/2010",
          "05/06/2012",
          "05/06/2018",
          "05/07/2011",
          "05/07/2012",
          "05/07/2014",
          "05/07/2016",
          "05/07/2018",
          "05/08/2014",
          "05/08/2017",
          "05/09/2009",
          "05/09/2015",
          "05/09/2017",
          "05/10/2010",
          "05/10/2013",
          "05/10/2014",
          "05/10/2016",
          "05/11/2011",
          "05/11/2013",
          "05/11/2016",
          "05/12/2009",
          "05/12/2015",
          "05/12/2017",
          "06/01/2015",
          "06/01/2018",
          "06/02/2010",
          "06/02/2016",
          "06/02/2018",
          "06/03/2010",
          "06/03/2012",
          "06/03/2018",
          "06/04/2010",
          "06/04/2013",
          "06/04/2017",
          "06/04/2019",
          "06/05/2010",
          "06/05/2017",
          "06/05/2019",
          "06/06/2009",
          "06/06/2015",
          "06/06/2017",
          "06/06/2019",
          "06/07/2010",
          "06/07/2013",
          "06/07/2017",
          "06/07/2019",
          "06/08/2009",
          "06/08/2011",
          "06/08/2013",
          "06/08/2016",
          "06/08/2019",
          "06/09/2011",
          "06/09/2012",
          "06/09/2014",
          "06/09/2016",
          "06/09/2018",
          "06/10/2009",
          "06/10/2012",
          "06/10/2015",
          "06/10/2018",
          "06/11/2010",
          "06/11/2012",
          "06/11/2018",
          "06/12/2011",
          "06/12/2012",
          "06/12/2014",
          "06/12/2016",
          "07/01/2012",
          "07/01/2014",
          "07/01/2017",
          "07/02/2012",
          "07/02/2015",
          "07/02/2017",
          "07/02/2019",
          "07/03/2009",
          "07/03/2015",
          "07/03/2017",
          "07/03/2019",
          "07/04/2009",
          "07/04/2015",
          "07/05/2009",
          "07/05/2011",
          "07/05/2013",
          "07/05/2014",
          "07/05/2016",
          "07/06/2012",
          "07/06/2014",
          "07/06/2016",
          "07/06/2018",
          "07/07/2009",
          "07/07/2012",
          "07/07/2015",
          "07/07/2018",
          "07/08/2010",
          "07/08/2012",
          "07/08/2018",
          "07/09/2010",
          "07/09/2017",
          "07/10/2014",
          "07/10/2017",
          "07/11/2009",
          "07/11/2015",
          "07/11/2017",
          "07/12/2010",
          "07/12/2013",
          "07/12/2017",
          "08/01/2011",
          "08/01/2013",
          "08/01/2019",
          "08/02/2011",
          "08/02/2014",
          "08/03/2011",
          "08/03/2014",
          "08/03/2016",
          "08/03/2018",
          "08/04/2012",
          "08/04/2014",
          "08/04/2017",
          "08/04/2018",
          "08/05/2010",
          "08/05/2012",
          "08/05/2018",
          "08/06/2010",
          "08/06/2011",
          "08/06/2013",
          "08/07/2014",
          "08/07/2017",
          "08/08/2009",
          "08/08/2015",
          "08/08/2017",
          "08/08/2019",
          "08/09/2009",
          "08/09/2012",
          "08/09/2013",
          "08/09/2015",
          "08/09/2018",
          "08/10/2013",
          "08/10/2016",
          "08/11/2011",
          "08/11/2014",
          "08/11/2016",
          "08/12/2009",
          "08/12/2012",
          "08/12/2015",
          "08/12/2018",
          "09/01/2010",
          "09/01/2016",
          "09/01/2018",
          "09/02/2010",
          "09/02/2013",
          "09/02/2016",
          "09/02/2019",
          "09/03/2010",
          "09/03/2013",
          "09/03/2019",
          "09/04/2011",
          "09/04/2013",
          "09/04/2016",
          "09/04/2019",
          "09/05/2009",
          "09/05/2015",
          "09/05/2017",
          "09/06/2009",
          "09/06/2012",
          "09/06/2015",
          "09/06/2018",
          "09/06/2019",
          "09/07/2011",
          "09/07/2013",
          "09/07/2016",
          "09/07/2019",
          "09/08/2011",
          "09/08/2014",
          "09/08/2016",
          "09/09/2014",
          "09/09/2017",
          "09/10/2010",
          "09/10/2011",
          "09/10/2012",
          "09/10/2018",
          "09/11/2010",
          "09/11/2013",
          "09/12/2014",
          "09/12/2017",
          "10/01/2012",
          "10/01/2015",
          "10/01/2017",
          "10/02/2015",
          "10/02/2018",
          "10/03/2009",
          "10/03/2012",
          "10/03/2015",
          "10/03/2018",
          "10/04/2010",
          "10/04/2012",
          "10/04/2018",
          "10/05/2014",
          "10/05/2016",
          "10/05/2018",
          "10/06/2014",
          "10/06/2017",
          "10/07/2010",
          "10/07/2012",
          "10/07/2018",
          "10/08/2010",
          "10/08/2013",
          "10/09/2011",
          "10/09/2013",
          "10/09/2016",
          "10/10/2009",
          "10/10/2015",
          "10/10/2016",
          "10/10/2017",
          "10/11/2009",
          "10/11/2012",
          "10/11/2015",
          "10/11/2018",
          "10/12/2013",
          "10/12/2016",
          "11/01/2011",
          "11/01/2014",
          "11/02/2012",
          "11/02/2014",
          "11/02/2017",
          "11/03/2014",
          "11/03/2017",
          "11/04/2009",
          "11/05/2010",
          "11/05/2011",
          "11/05/2013",
          "11/05/2017",
          "11/05/2019",
          "11/06/2011",
          "11/06/2013",
          "11/06/2019",
          "11/07/2009",
          "11/07/2015",
          "11/07/2017",
          "11/08/2009",
          "11/08/2012",
          "11/08/2015",
          "11/08/2018",
          "11/08/2019",
          "11/09/2012",
          "11/10/2011",
          "11/10/2014",
          "11/11/2014",
          "11/11/2017",
          "11/12/2010",
          "11/12/2011",
          "11/12/2012",
          "11/12/2018",
          "12/01/2010",
          "12/01/2013",
          "12/01/2016",
          "12/01/2019",
          "12/02/2011",
          "12/02/2013",
          "12/02/2019",
          "12/03/2011",
          "12/03/2013",
          "12/03/2016",
          "12/03/2019",
          "12/04/2011",
          "12/04/2014",
          "12/04/2015",
          "12/04/2016",
          "12/04/2017",
          "12/05/2009",
          "12/05/2012",
          "12/05/2015",
          "12/05/2018",
          "12/06/2010",
          "12/06/2012",
          "12/06/2016",
          "12/06/2018",
          "12/07/2011",
          "12/07/2014",
          "12/07/2016",
          "12/08/2014",
          "12/08/2017",
          "12/09/2009",
          "12/09/2010",
          "12/09/2015",
          "12/09/2017",
          "12/09/2018",
          "12/10/2010",
          "12/10/2013",
          "12/11/2011",
          "12/11/2013",
          "12/11/2016",
          "12/12/2009",
          "12/12/2015",
          "12/12/2017",
          "13/01/2015",
          "13/01/2018",
          "13/02/2010",
          "13/02/2016",
          "13/02/2018",
          "13/03/2010",
          "13/03/2012",
          "13/03/2018",
          "13/04/2010",
          "13/04/2013",
          "13/04/2019",
          "13/05/2014",
          "13/05/2017",
          "13/06/2009",
          "13/06/2015",
          "13/06/2017",
          "13/07/2010",
          "13/07/2013",
          "13/07/2019",
          "13/08/2011",
          "13/08/2013",
          "13/08/2019",
          "13/09/2011",
          "13/09/2014",
          "13/09/2016",
          "13/10/2009",
          "13/10/2012",
          "13/10/2015",
          "13/10/2018",
          "13/11/2010",
          "13/11/2012",
          "13/11/2018",
          "13/12/2011",
          "13/12/2014",
          "13/12/2016",
          "13/12/2018",
          "14/01/2012",
          "14/01/2014",
          "14/01/2017",
          "14/02/2012",
          "14/02/2015",
          "14/02/2017",
          "14/03/2009",
          "14/03/2015",
          "14/03/2017",
          "14/04/2015",
          "14/04/2018",
          "14/05/2011",
          "14/05/2016",
          "14/05/2019",
          "14/06/2011",
          "14/06/2014",
          "14/06/2016",
          "14/07/2009",
          "14/07/2012",
          "14/07/2015",
          "14/07/2018",
          "14/08/2010",
          "14/08/2012",
          "14/08/2016",
          "14/08/2018",
          "14/09/2010",
          "14/10/2014",
          "14/10/2017",
          "14/11/2009",
          "14/11/2015",
          "14/11/2017",
          "14/12/2010",
          "14/12/2013",
          "15/01/2011",
          "15/01/2013",
          "15/01/2019",
          "15/02/2011",
          "15/02/2014",
          "15/03/2011",
          "15/03/2014",
          "15/03/2016",
          "15/04/2009",
          "15/04/2012",
          "15/04/2017",
          "15/05/2010",
          "15/05/2012",
          "15/05/2013",
          "15/05/2018",
          "15/06/2010",
          "15/06/2013",
          "15/06/2017",
          "15/06/2019",
          "15/07/2014",
          "15/07/2017",
          "15/08/2009",
          "15/08/2015",
          "15/08/2017",
          "15/09/2009",
          "15/09/2012",
          "15/09/2013",
          "15/09/2018",
          "15/10/2011",
          "15/10/2013",
          "15/10/2016",
          "15/11/2011",
          "15/11/2014",
          "15/11/2016",
          "15/12/2009",
          "15/12/2012",
          "15/12/2015",
          "15/12/2018",
          "16/01/2010",
          "16/01/2016",
          "16/01/2018",
          "16/02/2010",
          "16/02/2013",
          "16/02/2016",
          "16/02/2019",
          "16/03/2010",
          "16/03/2013",
          "16/03/2019",
          "16/04/2011",
          "16/04/2014",
          "16/04/2016",
          "16/04/2018",
          "16/04/2019",
          "16/05/2009",
          "16/05/2015",
          "16/05/2017",
          "16/05/2019",
          "16/06/2009",
          "16/06/2012",
          "16/06/2015",
          "16/06/2018",
          "16/07/2011",
          "16/07/2013",
          "16/07/2016",
          "16/07/2019",
          "16/08/2011",
          "16/08/2014",
          "16/08/2016",
          "16/09/2014",
          "16/09/2015",
          "16/09/2017",
          "16/10/2010",
          "16/10/2012",
          "16/10/2018",
          "16/11/2010",
          "16/11/2013",
          "16/12/2014",
          "16/12/2017",
          "17/01/2012",
          "17/01/2015",
          "17/01/2017",
          "17/02/2015",
          "17/02/2018",
          "17/03/2009",
          "17/03/2012",
          "17/03/2015",
          "17/03/2018",
          "17/04/2010",
          "17/04/2012",
          "17/04/2013",
          "17/05/2011",
          "17/05/2014",
          "17/05/2016",
          "17/06/2014",
          "17/06/2017",
          "17/07/2010",
          "17/07/2012",
          "17/07/2018",
          "17/08/2010",
          "17/08/2013",
          "17/08/2019",
          "17/09/2011",
          "17/09/2013",
          "17/09/2016",
          "17/09/2018",
          "17/10/2009",
          "17/10/2015",
          "17/10/2017",
          "17/11/2009",
          "17/11/2012",
          "17/11/2015",
          "17/11/2018",
          "17/12/2011",
          "17/12/2013",
          "17/12/2016",
          "18/01/2011",
          "18/01/2014",
          "18/02/2012",
          "18/02/2014",
          "18/02/2017",
          "18/03/2014",
          "18/03/2017",
          "18/04/2009",
          "18/04/2015",
          "18/04/2017",
          "18/05/2013",
          "18/05/2019",
          "18/06/2009",
          "18/06/2011",
          "18/06/2013",
          "18/06/2016",
          "18/06/2019",
          "18/07/2009",
          "18/07/2015",
          "18/07/2017",
          "18/08/2009",
          "18/08/2012",
          "18/08/2015",
          "18/08/2018",
          "18/10/2011",
          "18/10/2012",
          "18/10/2014",
          "18/10/2016",
          "18/11/2014",
          "18/11/2017",
          "18/12/2010",
          "18/12/2012",
          "18/12/2018",
          "19/01/2010",
          "19/01/2013",
          "19/01/2016",
          "19/01/2019",
          "19/02/2011",
          "19/02/2013",
          "19/02/2019",
          "19/03/2011",
          "19/03/2013",
          "19/03/2016",
          "19/03/2019",
          "19/04/2014",
          "19/04/2016",
          "19/05/2009",
          "19/05/2010",
          "19/05/2012",
          "19/05/2015",
          "19/06/2010",
          "19/06/2012",
          "19/06/2018",
          "19/07/2011",
          "19/07/2014",
          "19/07/2016",
          "19/08/2014",
          "19/08/2017",
          "19/09/2010",
          "19/09/2015",
          "19/09/2017",
          "19/10/2010",
          "19/10/2013",
          "19/10/2017",
          "19/11/2011",
          "19/11/2013",
          "19/11/2016",
          "19/12/2009",
          "19/12/2015",
          "19/12/2017",
          "20/01/2015",
          "20/01/2018",
          "20/02/2010",
          "20/02/2016",
          "20/02/2018",
          "20/03/2010",
          "20/03/2012",
          "20/03/2018",
          "20/04/2011",
          "20/04/2013",
          "20/04/2019",
          "20/05/2014",
          "20/05/2017",
          "20/05/2018",
          "20/06/2009",
          "20/06/2015",
          "20/06/2017",
          "20/06/2019",
          "20/07/2010",
          "20/07/2013",
          "20/07/2019",
          "20/08/2011",
          "20/08/2013",
          "20/08/2016",
          "20/09/2009",
          "20/09/2011",
          "20/09/2012",
          "20/09/2014",
          "20/09/2016",
          "20/10/2009",
          "20/10/2012",
          "20/10/2015",
          "20/10/2018",
          "20/11/2010",
          "20/11/2012",
          "20/11/2018",
          "20/12/2011",
          "20/12/2012",
          "20/12/2014",
          "20/12/2016",
          "21/01/2012",
          "21/01/2014",
          "21/01/2017",
          "21/02/2012",
          "21/02/2015",
          "21/02/2017",
          "21/03/2009",
          "21/03/2015",
          "21/03/2017",
          "21/04/2009",
          "21/04/2010",
          "21/04/2012",
          "21/04/2015",
          "21/04/2018",
          "21/05/2011",
          "21/05/2013",
          "21/05/2016",
          "21/05/2019",
          "21/06/2011",
          "21/06/2012",
          "21/06/2014",
          "21/06/2016",
          "21/06/2018",
          "21/07/2009",
          "21/07/2012",
          "21/07/2015",
          "21/08/2010",
          "21/08/2012",
          "21/08/2018",
          "21/09/2010",
          "21/09/2013",
          "21/09/2015",
          "21/10/2014",
          "21/10/2017",
          "21/11/2009",
          "21/11/2015",
          "21/11/2017",
          "21/12/2010",
          "21/12/2013",
          "22/01/2011",
          "22/01/2013",
          "22/01/2019",
          "22/02/2011",
          "22/02/2014",
          "22/03/2011",
          "22/03/2014",
          "22/03/2016",
          "22/04/2014",
          "22/04/2017",
          "22/05/2010",
          "22/05/2012",
          "22/05/2018",
          "22/06/2010",
          "22/06/2013",
          "22/06/2019",
          "22/07/2014",
          "22/07/2017",
          "22/07/2018",
          "22/08/2009",
          "22/08/2015",
          "22/08/2017",
          "22/09/2009",
          "22/09/2012",
          "22/09/2018",
          "22/10/2013",
          "22/10/2016",
          "22/11/2011",
          "22/11/2014",
          "22/11/2016",
          "22/12/2009",
          "22/12/2012",
          "22/12/2015",
          "22/12/2018",
          "23/01/2010",
          "23/01/2016",
          "23/01/2018",
          "23/02/2010",
          "23/02/2013",
          "23/02/2016",
          "23/02/2019",
          "23/03/2010",
          "23/03/2013",
          "23/03/2017",
          "23/03/2019",
          "23/04/2011",
          "23/04/2012",
          "23/04/2013",
          "23/04/2016",
          "23/04/2019",
          "23/05/2009",
          "23/05/2017",
          "23/06/2009",
          "23/06/2012",
          "23/06/2015",
          "23/06/2018",
          "23/07/2011",
          "23/07/2013",
          "23/07/2016",
          "23/07/2019",
          "23/08/2011",
          "23/08/2014",
          "23/08/2016",
          "23/09/2014",
          "23/10/2010",
          "23/10/2011",
          "23/10/2012",
          "23/10/2018",
          "23/11/2010",
          "23/11/2013",
          "23/12/2014",
          "23/12/2017",
          "24/01/2012",
          "24/01/2015",
          "24/01/2017",
          "24/02/2015",
          "24/02/2018",
          "24/03/2009",
          "24/03/2012",
          "24/03/2015",
          "24/03/2018",
          "24/04/2010",
          "24/04/2018",
          "24/05/2011",
          "24/05/2014",
          "24/05/2015",
          "24/05/2016",
          "24/06/2010",
          "24/06/2014",
          "24/06/2017",
          "24/07/2010",
          "24/07/2012",
          "24/07/2018",
          "24/08/2010",
          "24/08/2013",
          "24/08/2017",
          "24/09/2011",
          "24/09/2013",
          "24/09/2016",
          "24/09/2017",
          "24/10/2009",
          "24/10/2015",
          "24/10/2017",
          "24/11/2009",
          "24/11/2012",
          "24/11/2015",
          "24/11/2018",
          "24/12/2011",
          "24/12/2013",
          "24/12/2016",
          "25/01/2011",
          "25/01/2014",
          "25/02/2012",
          "25/02/2014",
          "25/02/2017",
          "25/03/2014",
          "25/03/2017",
          "25/04/2009",
          "25/04/2015",
          "25/04/2017",
          "25/05/2010",
          "25/05/2013",
          "25/05/2019",
          "25/06/2011",
          "25/06/2013",
          "25/06/2016",
          "25/06/2019",
          "25/07/2009",
          "25/07/2017",
          "25/08/2009",
          "25/08/2012",
          "25/08/2015",
          "25/08/2018",
          "25/09/2010",
          "25/09/2018",
          "25/10/2011",
          "25/10/2014",
          "25/10/2016",
          "25/11/2014",
          "25/11/2017",
          "25/12/2010",
          "25/12/2012",
          "25/12/2018",
          "26/01/2010",
          "26/01/2013",
          "26/01/2016",
          "26/01/2019",
          "26/02/2011",
          "26/02/2013",
          "26/02/2019",
          "26/03/2011",
          "26/03/2016",
          "26/03/2019",
          "26/04/2014",
          "26/04/2016",
          "26/04/2018",
          "26/05/2009",
          "26/05/2015",
          "26/05/2018",
          "26/06/2010",
          "26/06/2012",
          "26/06/2018",
          "26/07/2011",
          "26/07/2014",
          "26/07/2015",
          "26/07/2016",
          "26/08/2014",
          "26/08/2017",
          "26/09/2009",
          "26/09/2015",
          "26/09/2017",
          "26/10/2010",
          "26/10/2013",
          "26/11/2011",
          "26/11/2013",
          "26/11/2016",
          "26/12/2009",
          "26/12/2015",
          "26/12/2017",
          "27/01/2015",
          "27/01/2018",
          "27/02/2010",
          "27/02/2016",
          "27/02/2018",
          "27/03/2010",
          "27/03/2012",
          "27/03/2013",
          "27/03/2018",
          "27/04/2010",
          "27/04/2011",
          "27/04/2013",
          "27/05/2012",
          "27/05/2014",
          "27/05/2017",
          "27/06/2009",
          "27/06/2015",
          "27/06/2017",
          "27/07/2010",
          "27/07/2012",
          "27/07/2013",
          "27/07/2019",
          "27/08/2011",
          "27/08/2013",
          "27/08/2016",
          "27/09/2011",
          "27/09/2012",
          "27/09/2016",
          "27/10/2009",
          "27/10/2012",
          "27/10/2015",
          "27/10/2018",
          "27/11/2010",
          "27/11/2012",
          "27/11/2018",
          "27/12/2011",
          "27/12/2014",
          "27/12/2016",
          "27/12/2018",
          "28/01/2012",
          "28/01/2014",
          "28/01/2017",
          "28/02/2009",
          "28/02/2012",
          "28/02/2015",
          "28/02/2017",
          "28/03/2009",
          "28/03/2015",
          "28/03/2017",
          "28/04/2012",
          "28/04/2015",
          "28/04/2018",
          "28/04/2019",
          "28/05/2011",
          "28/05/2013",
          "28/05/2016",
          "28/05/2019",
          "28/06/2011",
          "28/06/2014",
          "28/06/2016",
          "28/07/2009",
          "28/07/2015",
          "28/07/2018",
          "28/08/2010",
          "28/08/2012",
          "28/08/2018",
          "28/09/2010",
          "28/09/2013",
          "28/09/2014",
          "28/10/2014",
          "28/10/2017",
          "28/11/2009",
          "28/11/2015",
          "28/11/2017",
          "28/12/2010",
          "28/12/2013",
          "28/12/2017",
          "29/01/2011",
          "29/01/2013",
          "29/01/2019",
          "29/03/2011",
          "29/03/2012",
          "29/03/2014",
          "29/03/2016",
          "29/04/2009",
          "29/04/2014",
          "29/04/2017",
          "29/05/2010",
          "29/05/2012",
          "29/05/2018",
          "29/06/2010",
          "29/06/2013",
          "29/06/2019",
          "29/07/2014",
          "29/07/2017",
          "29/08/2009",
          "29/08/2015",
          "29/08/2017",
          "29/09/2009",
          "29/09/2012",
          "29/09/2015",
          "29/09/2018",
          "29/10/2011",
          "29/10/2013",
          "29/10/2016",
          "29/11/2011",
          "29/11/2014",
          "29/11/2016",
          "29/12/2009",
          "29/12/2012",
          "29/12/2015",
          "29/12/2018",
          "30/01/2010",
          "30/01/2016",
          "30/01/2018",
          "30/03/2010",
          "30/03/2013",
          "30/03/2019",
          "30/04/2011",
          "30/04/2013",
          "30/04/2019",
          "30/05/2009",
          "30/05/2015",
          "30/06/2009",
          "30/06/2012",
          "30/06/2015",
          "30/06/2018",
          "30/07/2011",
          "30/07/2013",
          "30/07/2016",
          "30/07/2019",
          "30/08/2011",
          "30/08/2014",
          "30/08/2016",
          "30/09/2014",
          "30/10/2010",
          "30/10/2012",
          "30/10/2018",
          "30/11/2010",
          "30/11/2013",
          "30/12/2014",
          "30/12/2017",
          "31/01/2012",
          "31/01/2015",
          "31/01/2017",
          "31/03/2009",
          "31/03/2012",
          "31/03/2015",
          "31/03/2018",
          "31/05/2011",
          "31/05/2014",
          "31/05/2016",
          "31/05/2017",
          "31/07/2010",
          "31/07/2012",
          "31/07/2018",
          "31/08/2010",
          "31/08/2013",
          "31/10/2009",
          "31/10/2015",
          "31/10/2017",
          "31/12/2011",
          "31/12/2013",
          "31/12/2016"
        ],
        "number_of_missing_values": "0"
      },
      {
        "data_type": "numeric",
        "index": "2",
        "is_ignore": "false",
        "is_row_identifier": "false",
        "is_target": "false",
        "name": "1",
        "number_of_missing_values": "0"
      },
      {
        "data_type": "numeric",
        "index": "3",
        "is_ignore": "false",
        "is_row_identifier": "false",
        "is_target": "false",
        "name": "2",
        "number_of_missing_values": "0"
      },
      {
        "data_type": "numeric",
        "index": "4",
        "is_ignore": "false",
        "is_row_identifier": "false",
        "is_target": "false",
        "name": "3",
        "number_of_missing_values": "0"
      },
      {
        "data_type": "numeric",
        "index": "5",
        "is_ignore": "false",
        "is_row_identifier": "false",
        "is_target": "false",
        "name": "4",
        "number_of_missing_values": "0"
      },
      {
        "data_type": "numeric",
        "index": "6",
        "is_ignore": "false",
        "is_row_identifier": "false",
        "is_target": "false",
        "name": "5",
        "number_of_missing_values": "0"
      },
      {
        "data_type": "numeric",
        "index": "7",
        "is_ignore": "false",
        "is_row_identifier": "false",
        "is_target": "false",
        "name": "6",
        "number_of_missing_values": "0"
      },
      {
        "data_type": "numeric",
        "index": "8",
        "is_ignore": "false",
        "is_row_identifier": "false",
        "is_target": "false",
        "name": "xtra",
        "number_of_missing_values": "0"
      },
      {
        "data_type": "numeric",
        "index": "9",
        "is_ignore": "false",
        "is_row_identifier": "false",
        "is_target": "false",
        "name": "win",
        "number_of_missing_values": "0"
      },
      {
        "data_type": "numeric",
        "index": "10",
        "is_ignore": "false",
        "is_row_identifier": "false",
        "is_target": "false",
        "name": "wind",
        "number_of_missing_values": "0"
      }
    ]
  }
}