{
  "data_set_description": {
    "collection_date": "2016-09-30",
    "creator": "socialmediadata",
    "default_target_attribute": "beer_style",
    "description": "This dataset consists of beer reviews from Beeradvocate. The data span a period of more than 10 years, including all ~1.5 million reviews up to November 2011. Each review includes ratings in terms of five \"aspects\": appearance, aroma, palate, taste, and overall impression. Reviews include product and user information, followed by each of these five ratings, and a plaintext review. We also have reviews from ratebeer.",
    "description_version": "1",
    "file_id": "21553086",
    "format": "arff",
    "id": "42089",
    "language": "English",
    "licence": "Public",
    "md5_checksum": "dd08bdcf03e7060aa1c535db9be33ad6",
    "minio_url": "https://data.openml.org/datasets/0004/42089/dataset_42089.pq",
    "name": "vancouver_employee",
    "original_data_url": "https://query.data.world/s/vmplvzsgmb2gdcomuhwktnzt2laoiy",
    "paper_url": "https://data.world/socialmediadata/beeradvocate",
    "parquet_url": "https://data.openml.org/datasets/0004/42089/dataset_42089.pq",
    "processing_date": "2019-08-14 18:35:24",
    "status": "active",
    "upload_date": "2019-08-14T18:21:33",
    "url": "https://api.openml.org/data/v1/download/21553086/vancouver_employee.arff",
    "version": "1",
    "version_label": "0.1",
    "visibility": "public"
  }
}