{
  "data_set_description": {
    "collection_date": "2015-08-13",
    "creator": "Federal Election Commission",
    "default_target_attribute": "transaction_amt",
    "description": "General Description\n2015-current: greater than $200.00. The Commission categorizes contributions from individuals using the calendar year-to-date amount for political action committee (PAC) and party committee receipts and the election-cycle-to-date amount for candidate receipts to determine whether the contribution meets the categorization threshold of greater than $200.00.\n\n1989-2014: $200 and above. The Commission categorized contributions from individuals using the reporting period amount to determine whether a contribution met the categorization threshold of $200.00 or more.\n\n1975-1988: $500 and above. The Commission categorized contributions from individuals using the reporting period amount to determine whether a contribution met the categorization threshold of $500.00 or more.\n\nheader description can be found here : https://classic.fec.gov/finance/disclosure/metadata/DataDictionaryContributionsbyIndividuals.shtml",
    "description_version": "1",
    "file_id": "21553061",
    "format": "arff",
    "id": "42080",
    "language": "English",
    "licence": "CC0 Public Domain",
    "md5_checksum": "5461942836de3f8c3c6a93a49d30a2b1",
    "minio_url": "https://data.openml.org/datasets/0004/42080/dataset_42080.pq",
    "name": "federal_election",
    "original_data_url": "https://cg-519a459a-0ea3-42c2-b7bc-fa1143481f74.s3-us-gov-west-1.amazonaws.com/bulk-downloads/2012/indiv12.zip",
    "paper_url": "https://classic.fec.gov/finance/disclosure/ftpdet.shtml",
    "parquet_url": "https://data.openml.org/datasets/0004/42080/dataset_42080.pq",
    "processing_date": "2019-08-14 14:53:24",
    "status": "active",
    "upload_date": "2019-08-14T14:44:24",
    "url": "https://api.openml.org/data/v1/download/21553061/federal_election.arff",
    "version": "1",
    "version_label": "0.1",
    "visibility": "public"
  }
}