{
  "data_set_description": {
    "collection_date": "2016-09-30",
    "creator": "socialmediadata",
    "default_target_attribute": "beer_style",
    "description": "This dataset consists of beer reviews from Beeradvocate. The data span a period of more than 10 years, including all ~1.5 million reviews up to November 2011. Each review includes ratings in terms of five \"aspects\": appearance, aroma, palate, taste, and overall impression. Reviews include product and user information, followed by each of these five ratings, and a plaintext review. We also have reviews from ratebeer.",
    "description_version": "1",
    "file_id": "21552938",
    "format": "arff",
    "id": "42078",
    "language": "English",
    "licence": "Public",
    "md5_checksum": "d0b20dd79d832b362b7c5858256de2df",
    "minio_url": "https://data.openml.org/datasets/0004/42078/dataset_42078.pq",
    "name": "beer_reviews",
    "original_data_url": "https://query.data.world/s/vmplvzsgmb2gdcomuhwktnzt2laoiy",
    "paper_url": "https://data.world/socialmediadata/beeradvocate",
    "parquet_url": "https://data.openml.org/datasets/0004/42078/dataset_42078.pq",
    "processing_date": "2019-08-13 18:45:26",
    "status": "active",
    "upload_date": "2019-08-13T18:44:37",
    "url": "https://api.openml.org/data/v1/download/21552938/beer_reviews.arff",
    "version": "4",
    "version_label": "0.1",
    "visibility": "public"
  }
}