{
  "data_qualities": {
    "quality": [
      {
        "name": "AutoCorrelation",
        "value": []
      },
      {
        "name": "ClassEntropy",
        "value": []
      },
      {
        "name": "Dimensionality",
        "value": "6.625588020936858E-5"
      },
      {
        "name": "EquivalentNumberOfAtts",
        "value": []
      },
      {
        "name": "MajorityClassPercentage",
        "value": []
      },
      {
        "name": "MajorityClassSize",
        "value": []
      },
      {
        "name": "MaxAttributeEntropy",
        "value": []
      },
      {
        "name": "MaxKurtosisOfNumericAtts",
        "value": "372.8242222705937"
      },
      {
        "name": "MaxMeansOfNumericAtts",
        "value": "87.88841847213962"
      },
      {
        "name": "MaxMutualInformation",
        "value": []
      },
      {
        "name": "MaxNominalAttDistinctValues",
        "value": []
      },
      {
        "name": "MaxSkewnessOfNumericAtts",
        "value": "11.820100133962184"
      },
      {
        "name": "MaxStdDevOfNumericAtts",
        "value": "36.32253619648603"
      },
      {
        "name": "MeanAttributeEntropy",
        "value": []
      },
      {
        "name": "MeanKurtosisOfNumericAtts",
        "value": "186.26890309695375"
      },
      {
        "name": "MeanMeansOfNumericAtts",
        "value": "60.50995048283566"
      },
      {
        "name": "MeanMutualInformation",
        "value": []
      },
      {
        "name": "MeanNoiseToSignalRatio",
        "value": []
      },
      {
        "name": "MeanNominalAttDistinctValues",
        "value": []
      },
      {
        "name": "MeanSkewnessOfNumericAtts",
        "value": "5.9814663838640225"
      },
      {
        "name": "MeanStdDevOfNumericAtts",
        "value": "19.772463977734596"
      },
      {
        "name": "MinAttributeEntropy",
        "value": []
      },
      {
        "name": "MinKurtosisOfNumericAtts",
        "value": "-0.28641607668617564"
      },
      {
        "name": "MinMeansOfNumericAtts",
        "value": "33.1314824935317"
      },
      {
        "name": "MinMutualInformation",
        "value": []
      },
      {
        "name": "MinNominalAttDistinctValues",
        "value": []
      },
      {
        "name": "MinSkewnessOfNumericAtts",
        "value": "0.14283263376586042"
      },
      {
        "name": "MinStdDevOfNumericAtts",
        "value": "3.222391758983159"
      },
      {
        "name": "MinorityClassPercentage",
        "value": []
      },
      {
        "name": "MinorityClassSize",
        "value": []
      },
      {
        "name": "NumberOfBinaryFeatures",
        "value": "0.0"
      },
      {
        "name": "NumberOfClasses",
        "value": []
      },
      {
        "name": "NumberOfFeatures",
        "value": "10.0"
      },
      {
        "name": "NumberOfInstances",
        "value": "150930.0"
      },
      {
        "name": "NumberOfInstancesWithMissingValues",
        "value": "111689.0"
      },
      {
        "name": "NumberOfMissingValues",
        "value": "174477.0"
      },
      {
        "name": "NumberOfNumericFeatures",
        "value": "2.0"
      },
      {
        "name": "NumberOfSymbolicFeatures",
        "value": "0.0"
      },
      {
        "name": "PercentageOfBinaryFeatures",
        "value": "0.0"
      },
      {
        "name": "PercentageOfInstancesWithMissingValues",
        "value": "74.00053004704168"
      },
      {
        "name": "PercentageOfMissingValues",
        "value": "11.560127211290002"
      },
      {
        "name": "PercentageOfNumericFeatures",
        "value": "20.0"
      },
      {
        "name": "PercentageOfSymbolicFeatures",
        "value": "0.0"
      },
      {
        "name": "Quartile1AttributeEntropy",
        "value": []
      },
      {
        "name": "Quartile1KurtosisOfNumericAtts",
        "value": "-0.28641607668617564"
      },
      {
        "name": "Quartile1MeansOfNumericAtts",
        "value": "33.1314824935317"
      },
      {
        "name": "Quartile1MutualInformation",
        "value": []
      },
      {
        "name": "Quartile1SkewnessOfNumericAtts",
        "value": "0.14283263376586042"
      },
      {
        "name": "Quartile1StdDevOfNumericAtts",
        "value": "3.222391758983159"
      },
      {
        "name": "Quartile2AttributeEntropy",
        "value": []
      },
      {
        "name": "Quartile2KurtosisOfNumericAtts",
        "value": "186.26890309695375"
      },
      {
        "name": "Quartile2MeansOfNumericAtts",
        "value": "60.50995048283566"
      },
      {
        "name": "Quartile2MutualInformation",
        "value": []
      },
      {
        "name": "Quartile2SkewnessOfNumericAtts",
        "value": "5.9814663838640225"
      },
      {
        "name": "Quartile2StdDevOfNumericAtts",
        "value": "19.772463977734596"
      },
      {
        "name": "Quartile3AttributeEntropy",
        "value": []
      },
      {
        "name": "Quartile3KurtosisOfNumericAtts",
        "value": "372.8242222705937"
      },
      {
        "name": "Quartile3MeansOfNumericAtts",
        "value": "87.88841847213962"
      },
      {
        "name": "Quartile3MutualInformation",
        "value": []
      },
      {
        "name": "Quartile3SkewnessOfNumericAtts",
        "value": "11.820100133962184"
      },
      {
        "name": "Quartile3StdDevOfNumericAtts",
        "value": "36.32253619648603"
      },
      {
        "name": "StdvNominalAttDistinctValues",
        "value": []
      }
    ]
  }
}