{
  "data_qualities": {
    "quality": [
      {
        "name": "AutoCorrelation",
        "value": "0.9865771812080537"
      },
      {
        "name": "ClassEntropy",
        "value": "1.584962500721156"
      },
      {
        "name": "Dimensionality",
        "value": "0.03333333333333333"
      },
      {
        "name": "EquivalentNumberOfAtts",
        "value": []
      },
      {
        "name": "MajorityClassPercentage",
        "value": "33.33333333333333"
      },
      {
        "name": "MajorityClassSize",
        "value": "50.0"
      },
      {
        "name": "MaxAttributeEntropy",
        "value": []
      },
      {
        "name": "MaxKurtosisOfNumericAtts",
        "value": "0.22824904246820577"
      },
      {
        "name": "MaxMeansOfNumericAtts",
        "value": "5.843333333333334"
      },
      {
        "name": "MaxMutualInformation",
        "value": []
      },
      {
        "name": "MaxNominalAttDistinctValues",
        "value": "3.0"
      },
      {
        "name": "MaxSkewnessOfNumericAtts",
        "value": "0.3189656647136033"
      },
      {
        "name": "MaxStdDevOfNumericAtts",
        "value": "1.765298233259467"
      },
      {
        "name": "MeanAttributeEntropy",
        "value": []
      },
      {
        "name": "MeanKurtosisOfNumericAtts",
        "value": "-0.7666306027454601"
      },
      {
        "name": "MeanMeansOfNumericAtts",
        "value": "3.4645"
      },
      {
        "name": "MeanMutualInformation",
        "value": []
      },
      {
        "name": "MeanNoiseToSignalRatio",
        "value": []
      },
      {
        "name": "MeanNominalAttDistinctValues",
        "value": "3.0"
      },
      {
        "name": "MeanSkewnessOfNumericAtts",
        "value": "0.06400642348764582"
      },
      {
        "name": "MeanStdDevOfNumericAtts",
        "value": "0.9478670787835937"
      },
      {
        "name": "MinAttributeEntropy",
        "value": []
      },
      {
        "name": "MinKurtosisOfNumericAtts",
        "value": "-1.402103415521753"
      },
      {
        "name": "MinMeansOfNumericAtts",
        "value": "1.1993333333333336"
      },
      {
        "name": "MinMutualInformation",
        "value": []
      },
      {
        "name": "MinNominalAttDistinctValues",
        "value": "3.0"
      },
      {
        "name": "MinSkewnessOfNumericAtts",
        "value": "-0.27488417975101165"
      },
      {
        "name": "MinStdDevOfNumericAtts",
        "value": "0.4358662849366983"
      },
      {
        "name": "MinorityClassPercentage",
        "value": "33.33333333333333"
      },
      {
        "name": "MinorityClassSize",
        "value": "50.0"
      },
      {
        "name": "NumberOfBinaryFeatures",
        "value": "0.0"
      },
      {
        "name": "NumberOfClasses",
        "value": "3.0"
      },
      {
        "name": "NumberOfFeatures",
        "value": "5.0"
      },
      {
        "name": "NumberOfInstances",
        "value": "150.0"
      },
      {
        "name": "NumberOfInstancesWithMissingValues",
        "value": "0.0"
      },
      {
        "name": "NumberOfMissingValues",
        "value": "0.0"
      },
      {
        "name": "NumberOfNumericFeatures",
        "value": "4.0"
      },
      {
        "name": "NumberOfSymbolicFeatures",
        "value": "1.0"
      },
      {
        "name": "PercentageOfBinaryFeatures",
        "value": "0.0"
      },
      {
        "name": "PercentageOfInstancesWithMissingValues",
        "value": "0.0"
      },
      {
        "name": "PercentageOfMissingValues",
        "value": "0.0"
      },
      {
        "name": "PercentageOfNumericFeatures",
        "value": "80.0"
      },
      {
        "name": "PercentageOfSymbolicFeatures",
        "value": "20.0"
      },
      {
        "name": "Quartile1AttributeEntropy",
        "value": []
      },
      {
        "name": "Quartile1KurtosisOfNumericAtts",
        "value": "-1.3867285607944764"
      },
      {
        "name": "Quartile1MeansOfNumericAtts",
        "value": "1.6638333333333335"
      },
      {
        "name": "Quartile1MutualInformation",
        "value": []
      },
      {
        "name": "Quartile1SkewnessOfNumericAtts",
        "value": "-0.23190482172550414"
      },
      {
        "name": "Quartile1StdDevOfNumericAtts",
        "value": "0.5174591309426103"
      },
      {
        "name": "Quartile2AttributeEntropy",
        "value": []
      },
      {
        "name": "Quartile2KurtosisOfNumericAtts",
        "value": "-0.9463340189641466"
      },
      {
        "name": "Quartile2MeansOfNumericAtts",
        "value": "3.4076666666666666"
      },
      {
        "name": "Quartile2MutualInformation",
        "value": []
      },
      {
        "name": "Quartile2SkewnessOfNumericAtts",
        "value": "0.10597210449399584"
      },
      {
        "name": "Quartile2StdDevOfNumericAtts",
        "value": "0.7951518984691046"
      },
      {
        "name": "Quartile3AttributeEntropy",
        "value": []
      },
      {
        "name": "Quartile3KurtosisOfNumericAtts",
        "value": "0.03317077152224257"
      },
      {
        "name": "Quartile3MeansOfNumericAtts",
        "value": "5.322"
      },
      {
        "name": "Quartile3MutualInformation",
        "value": []
      },
      {
        "name": "Quartile3SkewnessOfNumericAtts",
        "value": "0.3179519876944458"
      },
      {
        "name": "Quartile3StdDevOfNumericAtts",
        "value": "1.530990206939066"
      },
      {
        "name": "StdvNominalAttDistinctValues",
        "value": "0.0"
      }
    ]
  }
}