{
  "data_features": {
    "feature": [
      {
        "data_type": "nominal",
        "index": "0",
        "is_ignore": "false",
        "is_row_identifier": "false",
        "is_target": "false",
        "name": "date",
        "nominal_value": [
          "april",
          "august",
          "july",
          "june",
          "may",
          "october",
          "september"
        ],
        "number_of_missing_values": "1"
      },
      {
        "data_type": "nominal",
        "index": "1",
        "is_ignore": "false",
        "is_row_identifier": "false",
        "is_target": "false",
        "name": "plant-stand",
        "nominal_value": [
          "lt-normal",
          "normal"
        ],
        "number_of_missing_values": "36"
      },
      {
        "data_type": "nominal",
        "index": "2",
        "is_ignore": "false",
        "is_row_identifier": "false",
        "is_target": "false",
        "name": "precip",
        "nominal_value": [
          "gt-norm",
          "lt-norm",
          "norm"
        ],
        "number_of_missing_values": "38"
      },
      {
        "data_type": "nominal",
        "index": "3",
        "is_ignore": "false",
        "is_row_identifier": "false",
        "is_target": "false",
        "name": "temp",
        "nominal_value": [
          "gt-norm",
          "lt-norm",
          "norm"
        ],
        "number_of_missing_values": "30"
      },
      {
        "data_type": "nominal",
        "index": "4",
        "is_ignore": "false",
        "is_row_identifier": "false",
        "is_target": "false",
        "name": "hail",
        "nominal_value": [
          "no",
          "yes"
        ],
        "number_of_missing_values": "121"
      },
      {
        "data_type": "nominal",
        "index": "5",
        "is_ignore": "false",
        "is_row_identifier": "false",
        "is_target": "false",
        "name": "crop-hist",
        "nominal_value": [
          "diff-lst-year",
          "same-lst-sev-yrs",
          "same-lst-two-yrs",
          "same-lst-yr"
        ],
        "number_of_missing_values": "16"
      },
      {
        "data_type": "nominal",
        "index": "6",
        "is_ignore": "false",
        "is_row_identifier": "false",
        "is_target": "false",
        "name": "area-damaged",
        "nominal_value": [
          "low-areas",
          "scattered",
          "upper-areas",
          "whole-field"
        ],
        "number_of_missing_values": "1"
      },
      {
        "data_type": "nominal",
        "index": "7",
        "is_ignore": "false",
        "is_row_identifier": "false",
        "is_target": "false",
        "name": "severity",
        "nominal_value": [
          "minor",
          "pot-severe",
          "severe"
        ],
        "number_of_missing_values": "121"
      },
      {
        "data_type": "nominal",
        "index": "8",
        "is_ignore": "false",
        "is_row_identifier": "false",
        "is_target": "false",
        "name": "seed-tmt",
        "nominal_value": [
          "fungicide",
          "none",
          "other"
        ],
        "number_of_missing_values": "121"
      },
      {
        "data_type": "nominal",
        "index": "9",
        "is_ignore": "false",
        "is_row_identifier": "false",
        "is_target": "false",
        "name": "germination",
        "nominal_value": [
          "80-89",
          "90-100",
          "lt-80"
        ],
        "number_of_missing_values": "112"
      },
      {
        "data_type": "nominal",
        "index": "10",
        "is_ignore": "false",
        "is_row_identifier": "false",
        "is_target": "false",
        "name": "plant-growth",
        "nominal_value": [
          "abnorm",
          "norm"
        ],
        "number_of_missing_values": "16"
      },
      {
        "data_type": "nominal",
        "index": "11",
        "is_ignore": "false",
        "is_row_identifier": "false",
        "is_target": "false",
        "name": "leaves",
        "nominal_value": [
          "abnorm",
          "norm"
        ],
        "number_of_missing_values": "0"
      },
      {
        "data_type": "nominal",
        "index": "12",
        "is_ignore": "false",
        "is_row_identifier": "false",
        "is_target": "false",
        "name": "leafspots-halo",
        "nominal_value": [
          "absent",
          "no-yellow-halos",
          "yellow-halos"
        ],
        "number_of_missing_values": "84"
      },
      {
        "data_type": "nominal",
        "index": "13",
        "is_ignore": "false",
        "is_row_identifier": "false",
        "is_target": "false",
        "name": "leafspots-marg",
        "nominal_value": [
          "dna",
          "no-w-s-marg",
          "w-s-marg"
        ],
        "number_of_missing_values": "84"
      },
      {
        "data_type": "nominal",
        "index": "14",
        "is_ignore": "false",
        "is_row_identifier": "false",
        "is_target": "false",
        "name": "leafspot-size",
        "nominal_value": [
          "dna",
          "gt-1/8",
          "lt-1/8"
        ],
        "number_of_missing_values": "84"
      },
      {
        "data_type": "nominal",
        "index": "15",
        "is_ignore": "false",
        "is_row_identifier": "false",
        "is_target": "false",
        "name": "leaf-shread",
        "nominal_value": [
          "absent",
          "present"
        ],
        "number_of_missing_values": "100"
      },
      {
        "data_type": "nominal",
        "index": "16",
        "is_ignore": "false",
        "is_row_identifier": "false",
        "is_target": "false",
        "name": "leaf-malf",
        "nominal_value": [
          "absent",
          "present"
        ],
        "number_of_missing_values": "84"
      },
      {
        "data_type": "nominal",
        "index": "17",
        "is_ignore": "false",
        "is_row_identifier": "false",
        "is_target": "false",
        "name": "leaf-mild",
        "nominal_value": [
          "absent",
          "lower-surf",
          "upper-surf"
        ],
        "number_of_missing_values": "108"
      },
      {
        "data_type": "nominal",
        "index": "18",
        "is_ignore": "false",
        "is_row_identifier": "false",
        "is_target": "false",
        "name": "stem",
        "nominal_value": [
          "abnorm",
          "norm"
        ],
        "number_of_missing_values": "16"
      },
      {
        "data_type": "nominal",
        "index": "19",
        "is_ignore": "false",
        "is_row_identifier": "false",
        "is_target": "false",
        "name": "lodging",
        "nominal_value": [
          "no",
          "yes"
        ],
        "number_of_missing_values": "121"
      },
      {
        "data_type": "nominal",
        "index": "20",
        "is_ignore": "false",
        "is_row_identifier": "false",
        "is_target": "false",
        "name": "stem-cankers",
        "nominal_value": [
          "above-sec-nde",
          "above-soil",
          "absent",
          "below-soil"
        ],
        "number_of_missing_values": "38"
      },
      {
        "data_type": "nominal",
        "index": "21",
        "is_ignore": "false",
        "is_row_identifier": "false",
        "is_target": "false",
        "name": "canker-lesion",
        "nominal_value": [
          "brown",
          "dk-brown-blk",
          "dna",
          "tan"
        ],
        "number_of_missing_values": "38"
      },
      {
        "data_type": "nominal",
        "index": "22",
        "is_ignore": "false",
        "is_row_identifier": "false",
        "is_target": "false",
        "name": "fruiting-bodies",
        "nominal_value": [
          "absent",
          "present"
        ],
        "number_of_missing_values": "106"
      },
      {
        "data_type": "nominal",
        "index": "23",
        "is_ignore": "false",
        "is_row_identifier": "false",
        "is_target": "false",
        "name": "external-decay",
        "nominal_value": [
          "absent",
          "firm-and-dry",
          "watery"
        ],
        "number_of_missing_values": "38"
      },
      {
        "data_type": "nominal",
        "index": "24",
        "is_ignore": "false",
        "is_row_identifier": "false",
        "is_target": "false",
        "name": "mycelium",
        "nominal_value": [
          "absent",
          "present"
        ],
        "number_of_missing_values": "38"
      },
      {
        "data_type": "nominal",
        "index": "25",
        "is_ignore": "false",
        "is_row_identifier": "false",
        "is_target": "false",
        "name": "int-discolor",
        "nominal_value": [
          "black",
          "brown",
          "none"
        ],
        "number_of_missing_values": "38"
      },
      {
        "data_type": "nominal",
        "index": "26",
        "is_ignore": "false",
        "is_row_identifier": "false",
        "is_target": "false",
        "name": "sclerotia",
        "nominal_value": [
          "absent",
          "present"
        ],
        "number_of_missing_values": "38"
      },
      {
        "data_type": "nominal",
        "index": "27",
        "is_ignore": "false",
        "is_row_identifier": "false",
        "is_target": "false",
        "name": "fruit-pods",
        "nominal_value": [
          "diseased",
          "dna",
          "few-present",
          "norm"
        ],
        "number_of_missing_values": "84"
      },
      {
        "data_type": "nominal",
        "index": "28",
        "is_ignore": "false",
        "is_row_identifier": "false",
        "is_target": "false",
        "name": "fruit-spots",
        "nominal_value": [
          "absent",
          "brown-w/blk-specks",
          "colored",
          "distort",
          "dna"
        ],
        "number_of_missing_values": "106"
      },
      {
        "data_type": "nominal",
        "index": "29",
        "is_ignore": "false",
        "is_row_identifier": "false",
        "is_target": "false",
        "name": "seed",
        "nominal_value": [
          "abnorm",
          "norm"
        ],
        "number_of_missing_values": "92"
      },
      {
        "data_type": "nominal",
        "index": "30",
        "is_ignore": "false",
        "is_row_identifier": "false",
        "is_target": "false",
        "name": "mold-growth",
        "nominal_value": [
          "absent",
          "present"
        ],
        "number_of_missing_values": "92"
      },
      {
        "data_type": "nominal",
        "index": "31",
        "is_ignore": "false",
        "is_row_identifier": "false",
        "is_target": "false",
        "name": "seed-discolor",
        "nominal_value": [
          "absent",
          "present"
        ],
        "number_of_missing_values": "106"
      },
      {
        "data_type": "nominal",
        "index": "32",
        "is_ignore": "false",
        "is_row_identifier": "false",
        "is_target": "false",
        "name": "seed-size",
        "nominal_value": [
          "lt-norm",
          "norm"
        ],
        "number_of_missing_values": "92"
      },
      {
        "data_type": "nominal",
        "index": "33",
        "is_ignore": "false",
        "is_row_identifier": "false",
        "is_target": "false",
        "name": "shriveling",
        "nominal_value": [
          "absent",
          "present"
        ],
        "number_of_missing_values": "106"
      },
      {
        "data_type": "nominal",
        "index": "34",
        "is_ignore": "false",
        "is_row_identifier": "false",
        "is_target": "false",
        "name": "roots",
        "nominal_value": [
          "galls-cysts",
          "norm",
          "rotted"
        ],
        "number_of_missing_values": "31"
      },
      {
        "data_type": "nominal",
        "index": "35",
        "is_ignore": "false",
        "is_row_identifier": "false",
        "is_target": "true",
        "name": "class",
        "nominal_value": [
          "2-4-d-injury",
          "alternarialeaf-spot",
          "anthracnose",
          "bacterial-blight",
          "bacterial-pustule",
          "brown-spot",
          "brown-stem-rot",
          "charcoal-rot",
          "cyst-nematode",
          "diaporthe-pod-&-stem-blight",
          "diaporthe-stem-canker",
          "downy-mildew",
          "frog-eye-leaf-spot",
          "herbicide-injury",
          "phyllosticta-leaf-spot",
          "phytophthora-rot",
          "powdery-mildew",
          "purple-seed-stain",
          "rhizoctonia-root-rot"
        ],
        "number_of_missing_values": "0"
      }
    ]
  }
}