{
  "data_qualities": {
    "quality": [
      {
        "name": "AutoCorrelation",
        "value": "0.7652880126548092"
      },
      {
        "name": "ClassEntropy",
        "value": "5.0202781680766515"
      },
      {
        "name": "Dimensionality",
        "value": "0.0562703755859488"
      },
      {
        "name": "EquivalentNumberOfAtts",
        "value": []
      },
      {
        "name": "MajorityClassPercentage",
        "value": "5.78714867184938"
      },
      {
        "name": "MajorityClassSize",
        "value": "3000.0"
      },
      {
        "name": "MaxAttributeEntropy",
        "value": []
      },
      {
        "name": "MaxKurtosisOfNumericAtts",
        "value": "68.1544277387357"
      },
      {
        "name": "MaxMeansOfNumericAtts",
        "value": "0.4058249372754124"
      },
      {
        "name": "MaxMutualInformation",
        "value": []
      },
      {
        "name": "MaxNominalAttDistinctValues",
        "value": "43.0"
      },
      {
        "name": "MaxSkewnessOfNumericAtts",
        "value": "6.616477862495381"
      },
      {
        "name": "MaxStdDevOfNumericAtts",
        "value": "0.25427070901148635"
      },
      {
        "name": "MeanAttributeEntropy",
        "value": []
      },
      {
        "name": "MeanKurtosisOfNumericAtts",
        "value": "6.079271125721151"
      },
      {
        "name": "MeanMeansOfNumericAtts",
        "value": "0.09450929585833312"
      },
      {
        "name": "MeanMutualInformation",
        "value": []
      },
      {
        "name": "MeanNoiseToSignalRatio",
        "value": []
      },
      {
        "name": "MeanNominalAttDistinctValues",
        "value": "43.0"
      },
      {
        "name": "MeanSkewnessOfNumericAtts",
        "value": "1.9986897912665507"
      },
      {
        "name": "MeanStdDevOfNumericAtts",
        "value": "0.10105440350357404"
      },
      {
        "name": "MinAttributeEntropy",
        "value": []
      },
      {
        "name": "MinKurtosisOfNumericAtts",
        "value": "-1.4995494352899457"
      },
      {
        "name": "MinMeansOfNumericAtts",
        "value": "0.010294339489875353"
      },
      {
        "name": "MinMutualInformation",
        "value": []
      },
      {
        "name": "MinNominalAttDistinctValues",
        "value": "43.0"
      },
      {
        "name": "MinSkewnessOfNumericAtts",
        "value": "-0.6479417341016083"
      },
      {
        "name": "MinStdDevOfNumericAtts",
        "value": "0.025740671057526497"
      },
      {
        "name": "MinorityClassPercentage",
        "value": "0.5208433804664442"
      },
      {
        "name": "MinorityClassSize",
        "value": "270.0"
      },
      {
        "name": "NumberOfBinaryFeatures",
        "value": "0.0"
      },
      {
        "name": "NumberOfClasses",
        "value": "43.0"
      },
      {
        "name": "NumberOfFeatures",
        "value": "2917.0"
      },
      {
        "name": "NumberOfInstances",
        "value": "51839.0"
      },
      {
        "name": "NumberOfInstancesWithMissingValues",
        "value": "0.0"
      },
      {
        "name": "NumberOfMissingValues",
        "value": "0.0"
      },
      {
        "name": "NumberOfNumericFeatures",
        "value": "2916.0"
      },
      {
        "name": "NumberOfSymbolicFeatures",
        "value": "1.0"
      },
      {
        "name": "PercentageOfBinaryFeatures",
        "value": "0.0"
      },
      {
        "name": "PercentageOfInstancesWithMissingValues",
        "value": "0.0"
      },
      {
        "name": "PercentageOfMissingValues",
        "value": "0.0"
      },
      {
        "name": "PercentageOfNumericFeatures",
        "value": "99.96571820363387"
      },
      {
        "name": "PercentageOfSymbolicFeatures",
        "value": "0.03428179636612959"
      },
      {
        "name": "Quartile1AttributeEntropy",
        "value": []
      },
      {
        "name": "Quartile1KurtosisOfNumericAtts",
        "value": "1.9730259674990398"
      },
      {
        "name": "Quartile1MeansOfNumericAtts",
        "value": "0.054066792692157875"
      },
      {
        "name": "Quartile1MutualInformation",
        "value": []
      },
      {
        "name": "Quartile1SkewnessOfNumericAtts",
        "value": "1.4383568020761892"
      },
      {
        "name": "Quartile1StdDevOfNumericAtts",
        "value": "0.07396097700035001"
      },
      {
        "name": "Quartile2AttributeEntropy",
        "value": []
      },
      {
        "name": "Quartile2KurtosisOfNumericAtts",
        "value": "4.169428012230065"
      },
      {
        "name": "Quartile2MeansOfNumericAtts",
        "value": "0.08126531394010927"
      },
      {
        "name": "Quartile2MutualInformation",
        "value": []
      },
      {
        "name": "Quartile2SkewnessOfNumericAtts",
        "value": "1.8863057746253507"
      },
      {
        "name": "Quartile2StdDevOfNumericAtts",
        "value": "0.09464962552126241"
      },
      {
        "name": "Quartile3AttributeEntropy",
        "value": []
      },
      {
        "name": "Quartile3KurtosisOfNumericAtts",
        "value": "7.850437350146908"
      },
      {
        "name": "Quartile3MeansOfNumericAtts",
        "value": "0.11627721301974916"
      },
      {
        "name": "Quartile3MutualInformation",
        "value": []
      },
      {
        "name": "Quartile3SkewnessOfNumericAtts",
        "value": "2.497206926368271"
      },
      {
        "name": "Quartile3StdDevOfNumericAtts",
        "value": "0.12207652909277743"
      },
      {
        "name": "StdvNominalAttDistinctValues",
        "value": "0.0"
      }
    ]
  }
}