{
  "data_set_description": {
    "citation": "@inproceedings{Stallkamp-IJCNN-2011,\n    author = {Johannes Stallkamp and Marc Schlipsing and Jan Salmen and Christian Igel},\n    booktitle = {IEEE International Joint Conference on Neural Networks},\n    title = {The {G}erman {T}raffic {S}ign {R}ecognition {B}enchmark: A multi-class classification competition},\n    year = {2011},\n    pages = {1453--1460}\n}",
    "collection_date": "2011",
    "contributor": "Johannes Stallkamp, Marc Schlipsing, Jan Salmen, Christian Igel",
    "creator": "Johannes Stallkamp, Marc Schlipsing, Jan Salmen, Christian Igel",
    "default_target_attribute": "class",
    "description": "The German Traffic Sign Benchmark is a multi-class, single-image classification challenge held at the International Joint Conference on Neural Networks (IJCNN) 2011. We cordially invite researchers from relevant fields to participate: The competition is designed to allow for participation without special domain knowledge.\n\n# Pre-calculated features\n\nTo allow scientists without a background in image processing to participate, we several provide pre-calculated feature sets. Each feature set contains the same directory structure as the training image set. For details on the parameters of the feature algorithm, please have a look at the file Feature_description.txt which is part of each archive file.\n \n\\# HOG features\n    \nThe file contains three sets of differently configured HOG features (Histograms of Oriented Gradients). The sets contain feature vectors of length 1568, 1568, and 2916 respectively. The features were calculated using the source code from http://pascal.inrialpes.fr/soft/olt/. For detailed information on HOG, we refer to\n\nN. Dalal and B. Triggs. Histograms of Oriented Gradients for Human Detection. IEEE Conference on Computer Vision and Pattern Recognition, pages 886-893, 2005",
    "description_version": "1",
    "file_id": "21389478",
    "format": "arff",
    "id": "41989",
    "language": "English",
    "licence": "The data is free to use (when citing the publication).",
    "md5_checksum": "faa6837b5f6adb88da69a4763ebf4696",
    "minio_url": "https://data.openml.org/datasets/0004/41989/dataset_41989.pq",
    "name": "GTSRB-HOG03",
    "original_data_url": "http://benchmark.ini.rub.de/?section=gtsrb&subsection=dataset",
    "paper_url": "https://www.ini.rub.de/upload/file/1470692848_f03494010c16c36bab9e/StallkampEtAl_GTSRB_IJCNN2011.pdf",
    "parquet_url": "https://data.openml.org/datasets/0004/41989/dataset_41989.pq",
    "processing_date": "2019-07-24 01:16:06",
    "status": "active",
    "upload_date": "2019-07-24T01:09:36",
    "url": "https://api.openml.org/data/v1/download/21389478/GTSRB-HOG03.arff",
    "version": "1",
    "visibility": "public"
  }
}