{
  "data_qualities": {
    "quality": [
      {
        "name": "AutoCorrelation",
        "value": "0.09968713838769125"
      },
      {
        "name": "ClassEntropy",
        "value": "3.321928094887362"
      },
      {
        "name": "Dimensionality",
        "value": "0.011214285714285715"
      },
      {
        "name": "EquivalentNumberOfAtts",
        "value": []
      },
      {
        "name": "MajorityClassPercentage",
        "value": "10.0"
      },
      {
        "name": "MajorityClassSize",
        "value": "7000.0"
      },
      {
        "name": "MaxAttributeEntropy",
        "value": []
      },
      {
        "name": "MaxKurtosisOfNumericAtts",
        "value": "1455.1650213626558"
      },
      {
        "name": "MaxMeansOfNumericAtts",
        "value": "96.9042142857119"
      },
      {
        "name": "MaxMutualInformation",
        "value": []
      },
      {
        "name": "MaxNominalAttDistinctValues",
        "value": "10.0"
      },
      {
        "name": "MaxSkewnessOfNumericAtts",
        "value": "35.55290530672632"
      },
      {
        "name": "MaxStdDevOfNumericAtts",
        "value": "107.45428658724711"
      },
      {
        "name": "MeanAttributeEntropy",
        "value": []
      },
      {
        "name": "MeanKurtosisOfNumericAtts",
        "value": "15.753027118613666"
      },
      {
        "name": "MeanMeansOfNumericAtts",
        "value": "48.6368752733236"
      },
      {
        "name": "MeanMutualInformation",
        "value": []
      },
      {
        "name": "MeanNoiseToSignalRatio",
        "value": []
      },
      {
        "name": "MeanNominalAttDistinctValues",
        "value": "10.0"
      },
      {
        "name": "MeanSkewnessOfNumericAtts",
        "value": "2.4825933138883576"
      },
      {
        "name": "MeanStdDevOfNumericAtts",
        "value": "79.72991718218432"
      },
      {
        "name": "MinAttributeEntropy",
        "value": []
      },
      {
        "name": "MinKurtosisOfNumericAtts",
        "value": "-1.53621081807385"
      },
      {
        "name": "MinMeansOfNumericAtts",
        "value": "0.18894285714287146"
      },
      {
        "name": "MinMutualInformation",
        "value": []
      },
      {
        "name": "MinNominalAttDistinctValues",
        "value": "10.0"
      },
      {
        "name": "MinSkewnessOfNumericAtts",
        "value": "0.4570119770743755"
      },
      {
        "name": "MinStdDevOfNumericAtts",
        "value": "4.93537869401945"
      },
      {
        "name": "MinorityClassPercentage",
        "value": "10.0"
      },
      {
        "name": "MinorityClassSize",
        "value": "7000.0"
      },
      {
        "name": "NumberOfBinaryFeatures",
        "value": "0.0"
      },
      {
        "name": "NumberOfClasses",
        "value": "10.0"
      },
      {
        "name": "NumberOfFeatures",
        "value": "785.0"
      },
      {
        "name": "NumberOfInstances",
        "value": "70000.0"
      },
      {
        "name": "NumberOfInstancesWithMissingValues",
        "value": "0.0"
      },
      {
        "name": "NumberOfMissingValues",
        "value": "0.0"
      },
      {
        "name": "NumberOfNumericFeatures",
        "value": "784.0"
      },
      {
        "name": "NumberOfSymbolicFeatures",
        "value": "1.0"
      },
      {
        "name": "PercentageOfBinaryFeatures",
        "value": "0.0"
      },
      {
        "name": "PercentageOfInstancesWithMissingValues",
        "value": "0.0"
      },
      {
        "name": "PercentageOfMissingValues",
        "value": "0.0"
      },
      {
        "name": "PercentageOfNumericFeatures",
        "value": "99.87261146496816"
      },
      {
        "name": "PercentageOfSymbolicFeatures",
        "value": "0.12738853503184713"
      },
      {
        "name": "Quartile1AttributeEntropy",
        "value": []
      },
      {
        "name": "Quartile1KurtosisOfNumericAtts",
        "value": "-0.9239570907652648"
      },
      {
        "name": "Quartile1MeansOfNumericAtts",
        "value": "23.16656428571401"
      },
      {
        "name": "Quartile1MutualInformation",
        "value": []
      },
      {
        "name": "Quartile1SkewnessOfNumericAtts",
        "value": "0.9143279620469187"
      },
      {
        "name": "Quartile1StdDevOfNumericAtts",
        "value": "64.01636325227932"
      },
      {
        "name": "Quartile2AttributeEntropy",
        "value": []
      },
      {
        "name": "Quartile2KurtosisOfNumericAtts",
        "value": "0.36833507063322757"
      },
      {
        "name": "Quartile2MeansOfNumericAtts",
        "value": "51.55844999999974"
      },
      {
        "name": "Quartile2MutualInformation",
        "value": []
      },
      {
        "name": "Quartile2SkewnessOfNumericAtts",
        "value": "1.442198144291627"
      },
      {
        "name": "Quartile2StdDevOfNumericAtts",
        "value": "90.39537063315069"
      },
      {
        "name": "Quartile3AttributeEntropy",
        "value": []
      },
      {
        "name": "Quartile3KurtosisOfNumericAtts",
        "value": "6.335485641195298"
      },
      {
        "name": "Quartile3MeansOfNumericAtts",
        "value": "72.73588214285664"
      },
      {
        "name": "Quartile3MutualInformation",
        "value": []
      },
      {
        "name": "Quartile3SkewnessOfNumericAtts",
        "value": "2.773538082594681"
      },
      {
        "name": "Quartile3StdDevOfNumericAtts",
        "value": "100.78517649461983"
      },
      {
        "name": "StdvNominalAttDistinctValues",
        "value": "0.0"
      }
    ]
  }
}