{
  "data_set_description": {
    "description": "exercises",
    "description_version": "1",
    "file_id": "21378750",
    "format": "ARFF",
    "id": "41937",
    "licence": "CC0",
    "md5_checksum": "259c0eab1a0e6dff74448fb4cb154e68",
    "minio_url": "https://data.openml.org/datasets/0004/41937/dataset_41937.pq",
    "name": "exercises",
    "parquet_url": "https://data.openml.org/datasets/0004/41937/dataset_41937.pq",
    "processing_date": "2019-07-19 13:02:11",
    "status": "active",
    "upload_date": "2019-06-20T10:39:50",
    "url": "https://api.openml.org/data/v1/download/21378750/exercises.arff",
    "version": "1",
    "visibility": "public"
  }
}