{
  "data_qualities": {
    "quality": [
      {
        "name": "AutoCorrelation",
        "value": "0.5440397955458196"
      },
      {
        "name": "ClassEntropy",
        "value": "0.9982258177111878"
      },
      {
        "name": "Dimensionality",
        "value": "2.738163148887621E-4"
      },
      {
        "name": "EquivalentNumberOfAtts",
        "value": []
      },
      {
        "name": "MajorityClassPercentage",
        "value": "52.47917855105534"
      },
      {
        "name": "MajorityClassSize",
        "value": "22999.0"
      },
      {
        "name": "MaxAttributeEntropy",
        "value": []
      },
      {
        "name": "MaxKurtosisOfNumericAtts",
        "value": "1.2392063822752313"
      },
      {
        "name": "MaxMeansOfNumericAtts",
        "value": "1.435803692960619E12"
      },
      {
        "name": "MaxMutualInformation",
        "value": []
      },
      {
        "name": "MaxNominalAttDistinctValues",
        "value": "2.0"
      },
      {
        "name": "MaxSkewnessOfNumericAtts",
        "value": "0.9359697036498242"
      },
      {
        "name": "MaxStdDevOfNumericAtts",
        "value": "6.3762646076001305E10"
      },
      {
        "name": "MeanAttributeEntropy",
        "value": []
      },
      {
        "name": "MeanKurtosisOfNumericAtts",
        "value": "-0.05683699324963838"
      },
      {
        "name": "MeanMeansOfNumericAtts",
        "value": "1.3052760949123553E11"
      },
      {
        "name": "MeanMutualInformation",
        "value": []
      },
      {
        "name": "MeanNoiseToSignalRatio",
        "value": []
      },
      {
        "name": "MeanNominalAttDistinctValues",
        "value": "2.0"
      },
      {
        "name": "MeanSkewnessOfNumericAtts",
        "value": "0.11780472757523448"
      },
      {
        "name": "MeanStdDevOfNumericAtts",
        "value": "5.796604783769756E9"
      },
      {
        "name": "MinAttributeEntropy",
        "value": []
      },
      {
        "name": "MinKurtosisOfNumericAtts",
        "value": "-1.2000053419792795"
      },
      {
        "name": "MinMeansOfNumericAtts",
        "value": "1.6105559698802054"
      },
      {
        "name": "MinMutualInformation",
        "value": []
      },
      {
        "name": "MinNominalAttDistinctValues",
        "value": "2.0"
      },
      {
        "name": "MinSkewnessOfNumericAtts",
        "value": "-0.07279816343655837"
      },
      {
        "name": "MinStdDevOfNumericAtts",
        "value": "0.0732915536706817"
      },
      {
        "name": "MinorityClassPercentage",
        "value": "47.520821448944666"
      },
      {
        "name": "MinorityClassSize",
        "value": "20826.0"
      },
      {
        "name": "NumberOfBinaryFeatures",
        "value": "1.0"
      },
      {
        "name": "NumberOfClasses",
        "value": "2.0"
      },
      {
        "name": "NumberOfFeatures",
        "value": "12.0"
      },
      {
        "name": "NumberOfInstances",
        "value": "43825.0"
      },
      {
        "name": "NumberOfInstancesWithMissingValues",
        "value": "0.0"
      },
      {
        "name": "NumberOfMissingValues",
        "value": "0.0"
      },
      {
        "name": "NumberOfNumericFeatures",
        "value": "11.0"
      },
      {
        "name": "NumberOfSymbolicFeatures",
        "value": "1.0"
      },
      {
        "name": "PercentageOfBinaryFeatures",
        "value": "8.333333333333332"
      },
      {
        "name": "PercentageOfInstancesWithMissingValues",
        "value": "0.0"
      },
      {
        "name": "PercentageOfMissingValues",
        "value": "0.0"
      },
      {
        "name": "PercentageOfNumericFeatures",
        "value": "91.66666666666666"
      },
      {
        "name": "PercentageOfSymbolicFeatures",
        "value": "8.333333333333332"
      },
      {
        "name": "Quartile1AttributeEntropy",
        "value": []
      },
      {
        "name": "Quartile1KurtosisOfNumericAtts",
        "value": "-0.23780398227268318"
      },
      {
        "name": "Quartile1MeansOfNumericAtts",
        "value": "1.6120670229321163"
      },
      {
        "name": "Quartile1MutualInformation",
        "value": []
      },
      {
        "name": "Quartile1SkewnessOfNumericAtts",
        "value": "-0.07160561427446019"
      },
      {
        "name": "Quartile1StdDevOfNumericAtts",
        "value": "0.07338878657891716"
      },
      {
        "name": "Quartile2AttributeEntropy",
        "value": []
      },
      {
        "name": "Quartile2KurtosisOfNumericAtts",
        "value": "-0.23473057115218676"
      },
      {
        "name": "Quartile2MeansOfNumericAtts",
        "value": "1.612542893325727"
      },
      {
        "name": "Quartile2MutualInformation",
        "value": []
      },
      {
        "name": "Quartile2SkewnessOfNumericAtts",
        "value": "-0.07122039397100087"
      },
      {
        "name": "Quartile2StdDevOfNumericAtts",
        "value": "0.07341585699789686"
      },
      {
        "name": "Quartile3AttributeEntropy",
        "value": []
      },
      {
        "name": "Quartile3KurtosisOfNumericAtts",
        "value": "-0.2316846618211943"
      },
      {
        "name": "Quartile3MeansOfNumericAtts",
        "value": "5702.670052896748"
      },
      {
        "name": "Quartile3MutualInformation",
        "value": []
      },
      {
        "name": "Quartile3SkewnessOfNumericAtts",
        "value": "4.795467004368951E-6"
      },
      {
        "name": "Quartile3StdDevOfNumericAtts",
        "value": "3269.0887497149124"
      },
      {
        "name": "StdvNominalAttDistinctValues",
        "value": "0.0"
      }
    ]
  }
}