{
  "data_qualities": {
    "quality": [
      {
        "name": "AutoCorrelation",
        "value": "0.5349351953267616"
      },
      {
        "name": "ClassEntropy",
        "value": "0.9960999173688901"
      },
      {
        "name": "Dimensionality",
        "value": "2.738163148887621E-4"
      },
      {
        "name": "EquivalentNumberOfAtts",
        "value": []
      },
      {
        "name": "MajorityClassPercentage",
        "value": "53.6748431260696"
      },
      {
        "name": "MajorityClassSize",
        "value": "23523.0"
      },
      {
        "name": "MaxAttributeEntropy",
        "value": []
      },
      {
        "name": "MaxKurtosisOfNumericAtts",
        "value": "31.862539359423643"
      },
      {
        "name": "MaxMeansOfNumericAtts",
        "value": "1.435803692960619E12"
      },
      {
        "name": "MaxMutualInformation",
        "value": []
      },
      {
        "name": "MaxNominalAttDistinctValues",
        "value": "2.0"
      },
      {
        "name": "MaxSkewnessOfNumericAtts",
        "value": "4.276854339203023"
      },
      {
        "name": "MaxStdDevOfNumericAtts",
        "value": "6.3762646076001305E10"
      },
      {
        "name": "MeanAttributeEntropy",
        "value": []
      },
      {
        "name": "MeanKurtosisOfNumericAtts",
        "value": "4.282676384156065"
      },
      {
        "name": "MeanMeansOfNumericAtts",
        "value": "1.3052761028440755E11"
      },
      {
        "name": "MeanMutualInformation",
        "value": []
      },
      {
        "name": "MeanNoiseToSignalRatio",
        "value": []
      },
      {
        "name": "MeanNominalAttDistinctValues",
        "value": "2.0"
      },
      {
        "name": "MeanSkewnessOfNumericAtts",
        "value": "0.9008284539687236"
      },
      {
        "name": "MeanStdDevOfNumericAtts",
        "value": "5.796605966881062E9"
      },
      {
        "name": "MinAttributeEntropy",
        "value": []
      },
      {
        "name": "MinKurtosisOfNumericAtts",
        "value": "-1.3647685237873264"
      },
      {
        "name": "MinMeansOfNumericAtts",
        "value": "1.2092972422133486"
      },
      {
        "name": "MinMutualInformation",
        "value": []
      },
      {
        "name": "MinNominalAttDistinctValues",
        "value": "2.0"
      },
      {
        "name": "MinSkewnessOfNumericAtts",
        "value": "4.795467004368951E-6"
      },
      {
        "name": "MinStdDevOfNumericAtts",
        "value": "0.10120102233079038"
      },
      {
        "name": "MinorityClassPercentage",
        "value": "46.3251568739304"
      },
      {
        "name": "MinorityClassSize",
        "value": "20302.0"
      },
      {
        "name": "NumberOfBinaryFeatures",
        "value": "1.0"
      },
      {
        "name": "NumberOfClasses",
        "value": "2.0"
      },
      {
        "name": "NumberOfFeatures",
        "value": "12.0"
      },
      {
        "name": "NumberOfInstances",
        "value": "43825.0"
      },
      {
        "name": "NumberOfInstancesWithMissingValues",
        "value": "0.0"
      },
      {
        "name": "NumberOfMissingValues",
        "value": "0.0"
      },
      {
        "name": "NumberOfNumericFeatures",
        "value": "11.0"
      },
      {
        "name": "NumberOfSymbolicFeatures",
        "value": "1.0"
      },
      {
        "name": "PercentageOfBinaryFeatures",
        "value": "8.333333333333332"
      },
      {
        "name": "PercentageOfInstancesWithMissingValues",
        "value": "0.0"
      },
      {
        "name": "PercentageOfMissingValues",
        "value": "0.0"
      },
      {
        "name": "PercentageOfNumericFeatures",
        "value": "91.66666666666666"
      },
      {
        "name": "PercentageOfSymbolicFeatures",
        "value": "8.333333333333332"
      },
      {
        "name": "Quartile1AttributeEntropy",
        "value": []
      },
      {
        "name": "Quartile1KurtosisOfNumericAtts",
        "value": "-1.362990590368905"
      },
      {
        "name": "Quartile1MeansOfNumericAtts",
        "value": "1.2101138954934403"
      },
      {
        "name": "Quartile1MutualInformation",
        "value": []
      },
      {
        "name": "Quartile1SkewnessOfNumericAtts",
        "value": "0.17509194478506204"
      },
      {
        "name": "Quartile1StdDevOfNumericAtts",
        "value": "0.10124987013161794"
      },
      {
        "name": "Quartile2AttributeEntropy",
        "value": []
      },
      {
        "name": "Quartile2KurtosisOfNumericAtts",
        "value": "-1.3627382648146114"
      },
      {
        "name": "Quartile2MeansOfNumericAtts",
        "value": "1.2101640871648602"
      },
      {
        "name": "Quartile2MutualInformation",
        "value": []
      },
      {
        "name": "Quartile2SkewnessOfNumericAtts",
        "value": "0.17579480370488612"
      },
      {
        "name": "Quartile2StdDevOfNumericAtts",
        "value": "0.10125395375127139"
      },
      {
        "name": "Quartile3AttributeEntropy",
        "value": []
      },
      {
        "name": "Quartile3KurtosisOfNumericAtts",
        "value": "-1.2000053419792795"
      },
      {
        "name": "Quartile3MeansOfNumericAtts",
        "value": "9981.54554228858"
      },
      {
        "name": "Quartile3MutualInformation",
        "value": []
      },
      {
        "name": "Quartile3SkewnessOfNumericAtts",
        "value": "0.17669024972208436"
      },
      {
        "name": "Quartile3StdDevOfNumericAtts",
        "value": "9637.154245355048"
      },
      {
        "name": "StdvNominalAttDistinctValues",
        "value": "0.0"
      }
    ]
  }
}