{
  "data_qualities": {
    "quality": [
      {
        "name": "AutoCorrelation",
        "value": "0.4833424358274167"
      },
      {
        "name": "ClassEntropy",
        "value": "0.9999991402866273"
      },
      {
        "name": "Dimensionality",
        "value": "0.006550218340611353"
      },
      {
        "name": "EquivalentNumberOfAtts",
        "value": []
      },
      {
        "name": "MajorityClassPercentage",
        "value": "50.05458515283843"
      },
      {
        "name": "MajorityClassSize",
        "value": "917.0"
      },
      {
        "name": "MaxAttributeEntropy",
        "value": []
      },
      {
        "name": "MaxKurtosisOfNumericAtts",
        "value": "13.915198688117794"
      },
      {
        "name": "MaxMeansOfNumericAtts",
        "value": "1.4355589971615735E12"
      },
      {
        "name": "MaxMutualInformation",
        "value": []
      },
      {
        "name": "MaxNominalAttDistinctValues",
        "value": "2.0"
      },
      {
        "name": "MaxSkewnessOfNumericAtts",
        "value": "2.728815354155927"
      },
      {
        "name": "MaxStdDevOfNumericAtts",
        "value": "6.392337572974556E10"
      },
      {
        "name": "MeanAttributeEntropy",
        "value": []
      },
      {
        "name": "MeanKurtosisOfNumericAtts",
        "value": "1.3881335217739927"
      },
      {
        "name": "MeanMeansOfNumericAtts",
        "value": "1.3050537529510199E11"
      },
      {
        "name": "MeanMutualInformation",
        "value": []
      },
      {
        "name": "MeanNoiseToSignalRatio",
        "value": []
      },
      {
        "name": "MeanNominalAttDistinctValues",
        "value": "2.0"
      },
      {
        "name": "MeanSkewnessOfNumericAtts",
        "value": "0.5775270491705002"
      },
      {
        "name": "MeanStdDevOfNumericAtts",
        "value": "5.81122299997082E9"
      },
      {
        "name": "MinAttributeEntropy",
        "value": []
      },
      {
        "name": "MinKurtosisOfNumericAtts",
        "value": "-1.3541536141305321"
      },
      {
        "name": "MinMeansOfNumericAtts",
        "value": "9.37120843886463"
      },
      {
        "name": "MinMutualInformation",
        "value": []
      },
      {
        "name": "MinNominalAttDistinctValues",
        "value": "2.0"
      },
      {
        "name": "MinSkewnessOfNumericAtts",
        "value": "0.00279408944273918"
      },
      {
        "name": "MinStdDevOfNumericAtts",
        "value": "0.7754679982903695"
      },
      {
        "name": "MinorityClassPercentage",
        "value": "49.94541484716157"
      },
      {
        "name": "MinorityClassSize",
        "value": "915.0"
      },
      {
        "name": "NumberOfBinaryFeatures",
        "value": "1.0"
      },
      {
        "name": "NumberOfClasses",
        "value": "2.0"
      },
      {
        "name": "NumberOfFeatures",
        "value": "12.0"
      },
      {
        "name": "NumberOfInstances",
        "value": "1832.0"
      },
      {
        "name": "NumberOfInstancesWithMissingValues",
        "value": "0.0"
      },
      {
        "name": "NumberOfMissingValues",
        "value": "0.0"
      },
      {
        "name": "NumberOfNumericFeatures",
        "value": "11.0"
      },
      {
        "name": "NumberOfSymbolicFeatures",
        "value": "1.0"
      },
      {
        "name": "PercentageOfBinaryFeatures",
        "value": "8.333333333333332"
      },
      {
        "name": "PercentageOfInstancesWithMissingValues",
        "value": "0.0"
      },
      {
        "name": "PercentageOfMissingValues",
        "value": "0.0"
      },
      {
        "name": "PercentageOfNumericFeatures",
        "value": "91.66666666666666"
      },
      {
        "name": "PercentageOfSymbolicFeatures",
        "value": "8.333333333333332"
      },
      {
        "name": "Quartile1AttributeEntropy",
        "value": []
      },
      {
        "name": "Quartile1KurtosisOfNumericAtts",
        "value": "-1.347257406823997"
      },
      {
        "name": "Quartile1MeansOfNumericAtts",
        "value": "9.406495840611354"
      },
      {
        "name": "Quartile1MutualInformation",
        "value": []
      },
      {
        "name": "Quartile1SkewnessOfNumericAtts",
        "value": "0.11330903842836827"
      },
      {
        "name": "Quartile1StdDevOfNumericAtts",
        "value": "0.7779939125165639"
      },
      {
        "name": "Quartile2AttributeEntropy",
        "value": []
      },
      {
        "name": "Quartile2KurtosisOfNumericAtts",
        "value": "-1.3457745620352473"
      },
      {
        "name": "Quartile2MeansOfNumericAtts",
        "value": "9.40947614628821"
      },
      {
        "name": "Quartile2MutualInformation",
        "value": []
      },
      {
        "name": "Quartile2SkewnessOfNumericAtts",
        "value": "0.11844639008715402"
      },
      {
        "name": "Quartile2StdDevOfNumericAtts",
        "value": "0.778819656791812"
      },
      {
        "name": "Quartile3AttributeEntropy",
        "value": []
      },
      {
        "name": "Quartile3KurtosisOfNumericAtts",
        "value": "-1.2026981410569397"
      },
      {
        "name": "Quartile3MeansOfNumericAtts",
        "value": "65318.12192439957"
      },
      {
        "name": "Quartile3MutualInformation",
        "value": []
      },
      {
        "name": "Quartile3SkewnessOfNumericAtts",
        "value": "0.12159314974766043"
      },
      {
        "name": "Quartile3StdDevOfNumericAtts",
        "value": "38533.68565685964"
      },
      {
        "name": "StdvNominalAttDistinctValues",
        "value": "0.0"
      }
    ]
  }
}