{
  "data_qualities": {
    "quality": [
      {
        "name": "AutoCorrelation",
        "value": "0.5417133400205939"
      },
      {
        "name": "ClassEntropy",
        "value": "0.9982306697748855"
      },
      {
        "name": "Dimensionality",
        "value": "3.192848020434228E-5"
      },
      {
        "name": "EquivalentNumberOfAtts",
        "value": []
      },
      {
        "name": "MajorityClassPercentage",
        "value": "52.47578756917838"
      },
      {
        "name": "MajorityClassSize",
        "value": "197225.0"
      },
      {
        "name": "MaxAttributeEntropy",
        "value": []
      },
      {
        "name": "MaxKurtosisOfNumericAtts",
        "value": "96049.63025771981"
      },
      {
        "name": "MaxMeansOfNumericAtts",
        "value": "1.530459404482721E12"
      },
      {
        "name": "MaxMutualInformation",
        "value": []
      },
      {
        "name": "MaxNominalAttDistinctValues",
        "value": "2.0"
      },
      {
        "name": "MaxSkewnessOfNumericAtts",
        "value": "249.24794650143699"
      },
      {
        "name": "MaxStdDevOfNumericAtts",
        "value": "9.113188740296865E9"
      },
      {
        "name": "MeanAttributeEntropy",
        "value": []
      },
      {
        "name": "MeanKurtosisOfNumericAtts",
        "value": "8773.250817963435"
      },
      {
        "name": "MeanMeansOfNumericAtts",
        "value": "1.3913267315755267E11"
      },
      {
        "name": "MeanMutualInformation",
        "value": []
      },
      {
        "name": "MeanNoiseToSignalRatio",
        "value": []
      },
      {
        "name": "MeanNominalAttDistinctValues",
        "value": "2.0"
      },
      {
        "name": "MeanSkewnessOfNumericAtts",
        "value": "23.73478284864719"
      },
      {
        "name": "MeanStdDevOfNumericAtts",
        "value": "8.284717232105145E8"
      },
      {
        "name": "MinAttributeEntropy",
        "value": []
      },
      {
        "name": "MinKurtosisOfNumericAtts",
        "value": "-1.2001309970206575"
      },
      {
        "name": "MinMeansOfNumericAtts",
        "value": "1.5297119446040879"
      },
      {
        "name": "MinMutualInformation",
        "value": []
      },
      {
        "name": "MinNominalAttDistinctValues",
        "value": "2.0"
      },
      {
        "name": "MinSkewnessOfNumericAtts",
        "value": "6.153907279815181E-4"
      },
      {
        "name": "MinStdDevOfNumericAtts",
        "value": "0.02966755269024251"
      },
      {
        "name": "MinorityClassPercentage",
        "value": "47.52421243082163"
      },
      {
        "name": "MinorityClassSize",
        "value": "178615.0"
      },
      {
        "name": "NumberOfBinaryFeatures",
        "value": "1.0"
      },
      {
        "name": "NumberOfClasses",
        "value": "2.0"
      },
      {
        "name": "NumberOfFeatures",
        "value": "12.0"
      },
      {
        "name": "NumberOfInstances",
        "value": "375840.0"
      },
      {
        "name": "NumberOfInstancesWithMissingValues",
        "value": "0.0"
      },
      {
        "name": "NumberOfMissingValues",
        "value": "0.0"
      },
      {
        "name": "NumberOfNumericFeatures",
        "value": "11.0"
      },
      {
        "name": "NumberOfSymbolicFeatures",
        "value": "1.0"
      },
      {
        "name": "PercentageOfBinaryFeatures",
        "value": "8.333333333333332"
      },
      {
        "name": "PercentageOfInstancesWithMissingValues",
        "value": "0.0"
      },
      {
        "name": "PercentageOfMissingValues",
        "value": "0.0"
      },
      {
        "name": "PercentageOfNumericFeatures",
        "value": "91.66666666666666"
      },
      {
        "name": "PercentageOfSymbolicFeatures",
        "value": "8.333333333333332"
      },
      {
        "name": "Quartile1AttributeEntropy",
        "value": []
      },
      {
        "name": "Quartile1KurtosisOfNumericAtts",
        "value": "0.03655511174058601"
      },
      {
        "name": "Quartile1MeansOfNumericAtts",
        "value": "1.5298333721796507"
      },
      {
        "name": "Quartile1MutualInformation",
        "value": []
      },
      {
        "name": "Quartile1SkewnessOfNumericAtts",
        "value": "0.7230420376434615"
      },
      {
        "name": "Quartile1StdDevOfNumericAtts",
        "value": "0.029673151543587947"
      },
      {
        "name": "Quartile2AttributeEntropy",
        "value": []
      },
      {
        "name": "Quartile2KurtosisOfNumericAtts",
        "value": "0.03837858642177183"
      },
      {
        "name": "Quartile2MeansOfNumericAtts",
        "value": "1.5300583765964244"
      },
      {
        "name": "Quartile2MutualInformation",
        "value": []
      },
      {
        "name": "Quartile2SkewnessOfNumericAtts",
        "value": "0.7244351167147923"
      },
      {
        "name": "Quartile2StdDevOfNumericAtts",
        "value": "0.029676942191550773"
      },
      {
        "name": "Quartile3AttributeEntropy",
        "value": []
      },
      {
        "name": "Quartile3KurtosisOfNumericAtts",
        "value": "0.03884279578797356"
      },
      {
        "name": "Quartile3MeansOfNumericAtts",
        "value": "117.43049308349117"
      },
      {
        "name": "Quartile3MutualInformation",
        "value": []
      },
      {
        "name": "Quartile3SkewnessOfNumericAtts",
        "value": "0.7245426581681704"
      },
      {
        "name": "Quartile3StdDevOfNumericAtts",
        "value": "72.83668576266072"
      },
      {
        "name": "StdvNominalAttDistinctValues",
        "value": "0.0"
      }
    ]
  }
}