{
  "data_set_description": {
    "default_target_attribute": "Class",
    "description": "**Source**: Dukascopy Historical Data Feed https://www.dukascopy.com/swiss/english/marketwatch/historical/\n**Edited by**: Fabian Schut\n \n# Data Description\nThis is the historical price data of the FOREX NZD/USD from Dukascopy.\nOne instance (row) is one candlestick of one minute.\nThe whole dataset has the data range from 1-1-2018 to 13-12-2018 and does not include the weekends, since the FOREX is not traded in the weekend.\nThe timezone of the feature Timestamp is Europe/Amsterdam.\nThe class attribute is the direction of the mean of the High_Bid and the High_Ask of the following minute,\nrelative to the High_Bid and High_Ask mean of the current minute.\nThis means the class attribute is True when the mean High price is going up the following minute,\nand the class attribute is False when the mean High price is going down (or stays the same) the following minute.\n**Note that this is a hypothetical task, meant for scientific purposes only. Realistic trade strategies can only be applied to predictions on 'Close'-attributes (also available).\n# Attributes \n`Timestamp`: The time of the current data point (Europe/Amsterdam)\n`Bid_Open`: The bid price at the start of this time interval\n`Bid_High`: The highest bid price during this time interval\n`Bid_Low`: The lowest bid price during this time interval\n`Bid_Close`: The bid price at the end of this time interval\n`Bid_Volume`: The number of times the Bid Price changed within this time interval\n`Ask_Open`: The ask price at the start of this time interval\n`Ask_High`: The highest ask price during this time interval\n`Ask_Low`: The lowest ask price during this time interval\n`Ask_Close`: The ask price at the end of this time interval\n`Ask_Volume`: The number of times the Ask Price changed within this time interval\n`Class`: Whether the average price will go up during the next interval",
    "description_version": "1",
    "file_id": "21377849",
    "format": "arff",
    "id": "41807",
    "licence": "Public",
    "md5_checksum": "5f5f85e78b88d9d2117ce1476a3a6b5d",
    "minio_url": "https://data.openml.org/datasets/0004/41807/dataset_41807.pq",
    "name": "FOREX_nzdusd-minute-High",
    "parquet_url": "https://data.openml.org/datasets/0004/41807/dataset_41807.pq",
    "processing_date": "2019-06-04 00:16:02",
    "status": "active",
    "tag": [
      "finance",
      "forex",
      "forex_high",
      "forex_minute"
    ],
    "upload_date": "2019-06-04T00:15:48",
    "url": "https://api.openml.org/data/v1/download/21377849/FOREX_nzdusd-minute-High.arff",
    "version": "1",
    "visibility": "public"
  }
}