{
  "data_qualities": {
    "quality": [
      {
        "name": "AutoCorrelation",
        "value": "0.5423359470411533"
      },
      {
        "name": "ClassEntropy",
        "value": "0.9985306078036924"
      },
      {
        "name": "Dimensionality",
        "value": "3.192848020434228E-5"
      },
      {
        "name": "EquivalentNumberOfAtts",
        "value": []
      },
      {
        "name": "MajorityClassPercentage",
        "value": "52.25627926777352"
      },
      {
        "name": "MajorityClassSize",
        "value": "196400.0"
      },
      {
        "name": "MaxAttributeEntropy",
        "value": []
      },
      {
        "name": "MaxKurtosisOfNumericAtts",
        "value": "112.79211663993219"
      },
      {
        "name": "MaxMeansOfNumericAtts",
        "value": "1.530459404482721E12"
      },
      {
        "name": "MaxMutualInformation",
        "value": []
      },
      {
        "name": "MaxNominalAttDistinctValues",
        "value": "2.0"
      },
      {
        "name": "MaxSkewnessOfNumericAtts",
        "value": "2.6956965162533524"
      },
      {
        "name": "MaxStdDevOfNumericAtts",
        "value": "9.113188740296865E9"
      },
      {
        "name": "MeanAttributeEntropy",
        "value": []
      },
      {
        "name": "MeanKurtosisOfNumericAtts",
        "value": "10.392940648653303"
      },
      {
        "name": "MeanMeansOfNumericAtts",
        "value": "1.3913267315747855E11"
      },
      {
        "name": "MeanMutualInformation",
        "value": []
      },
      {
        "name": "MeanNoiseToSignalRatio",
        "value": []
      },
      {
        "name": "MeanNominalAttDistinctValues",
        "value": "2.0"
      },
      {
        "name": "MeanSkewnessOfNumericAtts",
        "value": "0.7138081441377567"
      },
      {
        "name": "MeanStdDevOfNumericAtts",
        "value": "8.28471716183366E8"
      },
      {
        "name": "MinAttributeEntropy",
        "value": []
      },
      {
        "name": "MinKurtosisOfNumericAtts",
        "value": "-1.2001309970206575"
      },
      {
        "name": "MinMeansOfNumericAtts",
        "value": "1.7061368210940828"
      },
      {
        "name": "MinMutualInformation",
        "value": []
      },
      {
        "name": "MinNominalAttDistinctValues",
        "value": "2.0"
      },
      {
        "name": "MinSkewnessOfNumericAtts",
        "value": "6.153907279815181E-4"
      },
      {
        "name": "MinStdDevOfNumericAtts",
        "value": "0.03342408858766811"
      },
      {
        "name": "MinorityClassPercentage",
        "value": "47.74372073222648"
      },
      {
        "name": "MinorityClassSize",
        "value": "179440.0"
      },
      {
        "name": "NumberOfBinaryFeatures",
        "value": "1.0"
      },
      {
        "name": "NumberOfClasses",
        "value": "2.0"
      },
      {
        "name": "NumberOfFeatures",
        "value": "12.0"
      },
      {
        "name": "NumberOfInstances",
        "value": "375840.0"
      },
      {
        "name": "NumberOfInstancesWithMissingValues",
        "value": "0.0"
      },
      {
        "name": "NumberOfMissingValues",
        "value": "0.0"
      },
      {
        "name": "NumberOfNumericFeatures",
        "value": "11.0"
      },
      {
        "name": "NumberOfSymbolicFeatures",
        "value": "1.0"
      },
      {
        "name": "PercentageOfBinaryFeatures",
        "value": "8.333333333333332"
      },
      {
        "name": "PercentageOfInstancesWithMissingValues",
        "value": "0.0"
      },
      {
        "name": "PercentageOfMissingValues",
        "value": "0.0"
      },
      {
        "name": "PercentageOfNumericFeatures",
        "value": "91.66666666666666"
      },
      {
        "name": "PercentageOfSymbolicFeatures",
        "value": "8.333333333333332"
      },
      {
        "name": "Quartile1AttributeEntropy",
        "value": []
      },
      {
        "name": "Quartile1KurtosisOfNumericAtts",
        "value": "-0.43211284360058366"
      },
      {
        "name": "Quartile1MeansOfNumericAtts",
        "value": "1.7062839187686243"
      },
      {
        "name": "Quartile1MutualInformation",
        "value": []
      },
      {
        "name": "Quartile1SkewnessOfNumericAtts",
        "value": "0.49565808656077226"
      },
      {
        "name": "Quartile1StdDevOfNumericAtts",
        "value": "0.03342767378532278"
      },
      {
        "name": "Quartile2AttributeEntropy",
        "value": []
      },
      {
        "name": "Quartile2KurtosisOfNumericAtts",
        "value": "-0.43000517702938357"
      },
      {
        "name": "Quartile2MeansOfNumericAtts",
        "value": "1.706663911238825"
      },
      {
        "name": "Quartile2MutualInformation",
        "value": []
      },
      {
        "name": "Quartile2SkewnessOfNumericAtts",
        "value": "0.49772921157181027"
      },
      {
        "name": "Quartile2StdDevOfNumericAtts",
        "value": "0.03342944835091411"
      },
      {
        "name": "Quartile3AttributeEntropy",
        "value": []
      },
      {
        "name": "Quartile3KurtosisOfNumericAtts",
        "value": "-0.42955090489618186"
      },
      {
        "name": "Quartile3MeansOfNumericAtts",
        "value": "117.6150735158628"
      },
      {
        "name": "Quartile3MutualInformation",
        "value": []
      },
      {
        "name": "Quartile3SkewnessOfNumericAtts",
        "value": "0.4981158225588626"
      },
      {
        "name": "Quartile3StdDevOfNumericAtts",
        "value": "68.05209562339829"
      },
      {
        "name": "StdvNominalAttDistinctValues",
        "value": "0.0"
      }
    ]
  }
}