{
  "data_qualities": {
    "quality": [
      {
        "name": "AutoCorrelation",
        "value": "0.7018457371374445"
      },
      {
        "name": "Dimensionality",
        "value": "3.192848020434228E-5"
      },
      {
        "name": "MajorityClassPercentage",
        "value": "73.47248829289059"
      },
      {
        "name": "MajorityClassSize",
        "value": "276139.0"
      },
      {
        "name": "MinorityClassPercentage",
        "value": "26.527511707109408"
      },
      {
        "name": "MinorityClassSize",
        "value": "99701.0"
      },
      {
        "name": "NumberOfBinaryFeatures",
        "value": "1.0"
      },
      {
        "name": "NumberOfClasses",
        "value": "2.0"
      },
      {
        "name": "NumberOfFeatures",
        "value": "12.0"
      },
      {
        "name": "NumberOfInstances",
        "value": "375840.0"
      },
      {
        "name": "NumberOfInstancesWithMissingValues",
        "value": "0.0"
      },
      {
        "name": "NumberOfMissingValues",
        "value": "0.0"
      },
      {
        "name": "NumberOfNumericFeatures",
        "value": "11.0"
      },
      {
        "name": "NumberOfSymbolicFeatures",
        "value": "1.0"
      },
      {
        "name": "PercentageOfBinaryFeatures",
        "value": "8.333333333333332"
      },
      {
        "name": "PercentageOfInstancesWithMissingValues",
        "value": "0.0"
      },
      {
        "name": "PercentageOfMissingValues",
        "value": "0.0"
      },
      {
        "name": "PercentageOfNumericFeatures",
        "value": "91.66666666666666"
      },
      {
        "name": "PercentageOfSymbolicFeatures",
        "value": "8.333333333333332"
      }
    ]
  }
}