{
  "data_set_description": {
    "default_target_attribute": "Class",
    "description": "**Source**: Dukascopy Historical Data Feed https://www.dukascopy.com/swiss/english/marketwatch/historical/\n**Edited by**: Fabian Schut\n \n# Data Description\nThis is the historical price data of the FOREX AUD/CAD from Dukascopy.\nOne instance (row) is one candlestick of one day.\nThe whole dataset has the data range from 1-1-2018 to 13-12-2018 and does not include the weekends, since the FOREX is not traded in the weekend.\nThe timezone of the feature Timestamp is Europe/Amsterdam.\nThe class attribute is the direction of the mean of the Close_Bid and the Close_Ask of the following day,\nrelative to the Close_Bid and Close_Ask mean of the current minute.\nThis means the class attribute is True when the mean Close price is going up the following day,\nand the class attribute is False when the mean Close price is going down (or stays the same) the following day.\n# Attributes \n`Timestamp`: The time of the current data point (Europe/Amsterdam)\n`Bid_Open`: The bid price at the start of this time interval\n`Bid_High`: The highest bid price during this time interval\n`Bid_Low`: The lowest bid price during this time interval\n`Bid_Close`: The bid price at the end of this time interval\n`Bid_Volume`: The number of times the Bid Price changed within this time interval\n`Ask_Open`: The ask price at the start of this time interval\n`Ask_High`: The highest ask price during this time interval\n`Ask_Low`: The lowest ask price during this time interval\n`Ask_Close`: The ask price at the end of this time interval\n`Ask_Volume`: The number of times the Ask Price changed within this time interval\n`Class`: Whether the average price will go up during the next interval",
    "description_version": "1",
    "file_id": "21377811",
    "format": "arff",
    "id": "41769",
    "licence": "Public",
    "md5_checksum": "d85e4f51ca190d67ec89d764e634235d",
    "minio_url": "https://data.openml.org/datasets/0004/41769/dataset_41769.pq",
    "name": "FOREX_audcad-day-Close",
    "parquet_url": "https://data.openml.org/datasets/0004/41769/dataset_41769.pq",
    "processing_date": "2021-09-16 21:32:11",
    "status": "active",
    "tag": [
      "finance",
      "forex",
      "forex_close",
      "forex_day"
    ],
    "upload_date": "2019-06-04T00:03:06",
    "url": "https://api.openml.org/data/v1/download/21377811/FOREX_audcad-day-Close.arff",
    "version": "1",
    "visibility": "public"
  }
}