{
  "data_qualities": {
    "quality": [
      {
        "name": "AutoCorrelation",
        "value": "0.49357570661905764"
      },
      {
        "name": "Dimensionality",
        "value": "3.192848020434228E-5"
      },
      {
        "name": "MajorityClassPercentage",
        "value": "52.55640698169434"
      },
      {
        "name": "MajorityClassSize",
        "value": "197528.0"
      },
      {
        "name": "MinorityClassPercentage",
        "value": "47.44359301830566"
      },
      {
        "name": "MinorityClassSize",
        "value": "178312.0"
      },
      {
        "name": "NumberOfBinaryFeatures",
        "value": "1.0"
      },
      {
        "name": "NumberOfClasses",
        "value": "2.0"
      },
      {
        "name": "NumberOfFeatures",
        "value": "12.0"
      },
      {
        "name": "NumberOfInstances",
        "value": "375840.0"
      },
      {
        "name": "NumberOfInstancesWithMissingValues",
        "value": "0.0"
      },
      {
        "name": "NumberOfMissingValues",
        "value": "0.0"
      },
      {
        "name": "NumberOfNumericFeatures",
        "value": "11.0"
      },
      {
        "name": "NumberOfSymbolicFeatures",
        "value": "1.0"
      },
      {
        "name": "PercentageOfBinaryFeatures",
        "value": "8.333333333333332"
      },
      {
        "name": "PercentageOfInstancesWithMissingValues",
        "value": "0.0"
      },
      {
        "name": "PercentageOfMissingValues",
        "value": "0.0"
      },
      {
        "name": "PercentageOfNumericFeatures",
        "value": "91.66666666666666"
      },
      {
        "name": "PercentageOfSymbolicFeatures",
        "value": "8.333333333333332"
      }
    ]
  }
}