{
  "data_qualities": {
    "quality": [
      {
        "name": "AutoCorrelation",
        "value": "0.4543726235741445"
      },
      {
        "name": "ClassEntropy",
        "value": "1.8800596155195604"
      },
      {
        "name": "Dimensionality",
        "value": "0.051233396584440226"
      },
      {
        "name": "EquivalentNumberOfAtts",
        "value": []
      },
      {
        "name": "MajorityClassPercentage",
        "value": "39.46869070208729"
      },
      {
        "name": "MajorityClassSize",
        "value": "208.0"
      },
      {
        "name": "MaxAttributeEntropy",
        "value": "-0.0"
      },
      {
        "name": "MaxKurtosisOfNumericAtts",
        "value": "12.56377261883461"
      },
      {
        "name": "MaxMeansOfNumericAtts",
        "value": "227.60476850094875"
      },
      {
        "name": "MaxMutualInformation",
        "value": "0.0"
      },
      {
        "name": "MaxNominalAttDistinctValues",
        "value": "4.0"
      },
      {
        "name": "MaxSkewnessOfNumericAtts",
        "value": "3.4875693231469778"
      },
      {
        "name": "MaxStdDevOfNumericAtts",
        "value": "589.6439702726236"
      },
      {
        "name": "MeanAttributeEntropy",
        "value": "0.0"
      },
      {
        "name": "MeanKurtosisOfNumericAtts",
        "value": "0.5803642623451464"
      },
      {
        "name": "MeanMeansOfNumericAtts",
        "value": "13.255893969463946"
      },
      {
        "name": "MeanMutualInformation",
        "value": "0.0"
      },
      {
        "name": "MeanNoiseToSignalRatio",
        "value": []
      },
      {
        "name": "MeanNominalAttDistinctValues",
        "value": "2.5"
      },
      {
        "name": "MeanSkewnessOfNumericAtts",
        "value": "0.5940176329080765"
      },
      {
        "name": "MeanStdDevOfNumericAtts",
        "value": "26.22674381221651"
      },
      {
        "name": "MinAttributeEntropy",
        "value": "-0.0"
      },
      {
        "name": "MinKurtosisOfNumericAtts",
        "value": "-2.006920996435009"
      },
      {
        "name": "MinMeansOfNumericAtts",
        "value": "0.06597881043643254"
      },
      {
        "name": "MinMutualInformation",
        "value": "0.0"
      },
      {
        "name": "MinNominalAttDistinctValues",
        "value": "1.0"
      },
      {
        "name": "MinSkewnessOfNumericAtts",
        "value": "-1.681204032266375"
      },
      {
        "name": "MinStdDevOfNumericAtts",
        "value": "0.0"
      },
      {
        "name": "MinorityClassPercentage",
        "value": "14.800759013282732"
      },
      {
        "name": "MinorityClassSize",
        "value": "78.0"
      },
      {
        "name": "NumberOfBinaryFeatures",
        "value": "0.0"
      },
      {
        "name": "NumberOfClasses",
        "value": "4.0"
      },
      {
        "name": "NumberOfFeatures",
        "value": "27.0"
      },
      {
        "name": "NumberOfInstances",
        "value": "527.0"
      },
      {
        "name": "NumberOfInstancesWithMissingValues",
        "value": "0.0"
      },
      {
        "name": "NumberOfMissingValues",
        "value": "0.0"
      },
      {
        "name": "NumberOfNumericFeatures",
        "value": "24.0"
      },
      {
        "name": "NumberOfSymbolicFeatures",
        "value": "2.0"
      },
      {
        "name": "PercentageOfBinaryFeatures",
        "value": "0.0"
      },
      {
        "name": "PercentageOfInstancesWithMissingValues",
        "value": "0.0"
      },
      {
        "name": "PercentageOfMissingValues",
        "value": "0.0"
      },
      {
        "name": "PercentageOfNumericFeatures",
        "value": "88.88888888888889"
      },
      {
        "name": "PercentageOfSymbolicFeatures",
        "value": "7.4074074074074066"
      },
      {
        "name": "Quartile1AttributeEntropy",
        "value": "-0.0"
      },
      {
        "name": "Quartile1KurtosisOfNumericAtts",
        "value": "-0.929937191724282"
      },
      {
        "name": "Quartile1MeansOfNumericAtts",
        "value": "0.4694085948766598"
      },
      {
        "name": "Quartile1MutualInformation",
        "value": "0.0"
      },
      {
        "name": "Quartile1SkewnessOfNumericAtts",
        "value": "0.15290569830085926"
      },
      {
        "name": "Quartile1StdDevOfNumericAtts",
        "value": "0.11833381727716658"
      },
      {
        "name": "Quartile2AttributeEntropy",
        "value": "-0.0"
      },
      {
        "name": "Quartile2KurtosisOfNumericAtts",
        "value": "-0.09129002077039106"
      },
      {
        "name": "Quartile2MeansOfNumericAtts",
        "value": "0.9021191593927897"
      },
      {
        "name": "Quartile2MutualInformation",
        "value": "0.0"
      },
      {
        "name": "Quartile2SkewnessOfNumericAtts",
        "value": "0.5970166284154503"
      },
      {
        "name": "Quartile2StdDevOfNumericAtts",
        "value": "0.4896066105882946"
      },
      {
        "name": "Quartile3AttributeEntropy",
        "value": "-0.0"
      },
      {
        "name": "Quartile3KurtosisOfNumericAtts",
        "value": "1.0373532811123254"
      },
      {
        "name": "Quartile3MeansOfNumericAtts",
        "value": "5.503790514705883"
      },
      {
        "name": "Quartile3MutualInformation",
        "value": "0.0"
      },
      {
        "name": "Quartile3SkewnessOfNumericAtts",
        "value": "0.7893456667918433"
      },
      {
        "name": "Quartile3StdDevOfNumericAtts",
        "value": "2.507183080477123"
      },
      {
        "name": "StdvNominalAttDistinctValues",
        "value": "2.1213203435596424"
      }
    ]
  }
}