{
  "data_qualities": {
    "quality": [
      {
        "name": "AutoCorrelation",
        "value": []
      },
      {
        "name": "ClassEntropy",
        "value": []
      },
      {
        "name": "Dimensionality",
        "value": "0.02857142857142857"
      },
      {
        "name": "EquivalentNumberOfAtts",
        "value": []
      },
      {
        "name": "MajorityClassPercentage",
        "value": []
      },
      {
        "name": "MajorityClassSize",
        "value": []
      },
      {
        "name": "MaxAttributeEntropy",
        "value": []
      },
      {
        "name": "MaxKurtosisOfNumericAtts",
        "value": "6.8287194475386315"
      },
      {
        "name": "MaxMeansOfNumericAtts",
        "value": "5624.702857142856"
      },
      {
        "name": "MaxMutualInformation",
        "value": []
      },
      {
        "name": "MaxNominalAttDistinctValues",
        "value": "3.0"
      },
      {
        "name": "MaxSkewnessOfNumericAtts",
        "value": "1.1194075814602158"
      },
      {
        "name": "MaxStdDevOfNumericAtts",
        "value": "9083.777537721406"
      },
      {
        "name": "MeanAttributeEntropy",
        "value": []
      },
      {
        "name": "MeanKurtosisOfNumericAtts",
        "value": "1.534079487055273"
      },
      {
        "name": "MeanMeansOfNumericAtts",
        "value": "2239.758095238095"
      },
      {
        "name": "MeanMutualInformation",
        "value": []
      },
      {
        "name": "MeanNoiseToSignalRatio",
        "value": []
      },
      {
        "name": "MeanNominalAttDistinctValues",
        "value": "3.0"
      },
      {
        "name": "MeanSkewnessOfNumericAtts",
        "value": "-0.37471382557916233"
      },
      {
        "name": "MeanStdDevOfNumericAtts",
        "value": "3289.7833224169653"
      },
      {
        "name": "MinAttributeEntropy",
        "value": []
      },
      {
        "name": "MinKurtosisOfNumericAtts",
        "value": "-1.4746556390242331"
      },
      {
        "name": "MinMeansOfNumericAtts",
        "value": "88.85714285714283"
      },
      {
        "name": "MinMutualInformation",
        "value": []
      },
      {
        "name": "MinNominalAttDistinctValues",
        "value": "3.0"
      },
      {
        "name": "MinSkewnessOfNumericAtts",
        "value": "-2.363831487635586"
      },
      {
        "name": "MinStdDevOfNumericAtts",
        "value": "13.41564180408141"
      },
      {
        "name": "MinorityClassPercentage",
        "value": []
      },
      {
        "name": "MinorityClassSize",
        "value": []
      },
      {
        "name": "NumberOfBinaryFeatures",
        "value": "0.0"
      },
      {
        "name": "NumberOfClasses",
        "value": []
      },
      {
        "name": "NumberOfFeatures",
        "value": "4.0"
      },
      {
        "name": "NumberOfInstances",
        "value": "140.0"
      },
      {
        "name": "NumberOfInstancesWithMissingValues",
        "value": "0.0"
      },
      {
        "name": "NumberOfMissingValues",
        "value": "0.0"
      },
      {
        "name": "NumberOfNumericFeatures",
        "value": "3.0"
      },
      {
        "name": "NumberOfSymbolicFeatures",
        "value": "1.0"
      },
      {
        "name": "PercentageOfBinaryFeatures",
        "value": "0.0"
      },
      {
        "name": "PercentageOfInstancesWithMissingValues",
        "value": "0.0"
      },
      {
        "name": "PercentageOfMissingValues",
        "value": "0.0"
      },
      {
        "name": "PercentageOfNumericFeatures",
        "value": "75.0"
      },
      {
        "name": "PercentageOfSymbolicFeatures",
        "value": "25.0"
      },
      {
        "name": "Quartile1AttributeEntropy",
        "value": []
      },
      {
        "name": "Quartile1KurtosisOfNumericAtts",
        "value": "-1.4746556390242331"
      },
      {
        "name": "Quartile1MeansOfNumericAtts",
        "value": "88.85714285714283"
      },
      {
        "name": "Quartile1MutualInformation",
        "value": []
      },
      {
        "name": "Quartile1SkewnessOfNumericAtts",
        "value": "-2.363831487635586"
      },
      {
        "name": "Quartile1StdDevOfNumericAtts",
        "value": "13.41564180408141"
      },
      {
        "name": "Quartile2AttributeEntropy",
        "value": []
      },
      {
        "name": "Quartile2KurtosisOfNumericAtts",
        "value": "-0.7518253473485794"
      },
      {
        "name": "Quartile2MeansOfNumericAtts",
        "value": "1005.7142857142856"
      },
      {
        "name": "Quartile2MutualInformation",
        "value": []
      },
      {
        "name": "Quartile2SkewnessOfNumericAtts",
        "value": "0.12028242943788325"
      },
      {
        "name": "Quartile2StdDevOfNumericAtts",
        "value": "772.1567877254087"
      },
      {
        "name": "Quartile3AttributeEntropy",
        "value": []
      },
      {
        "name": "Quartile3KurtosisOfNumericAtts",
        "value": "6.8287194475386315"
      },
      {
        "name": "Quartile3MeansOfNumericAtts",
        "value": "5624.702857142856"
      },
      {
        "name": "Quartile3MutualInformation",
        "value": []
      },
      {
        "name": "Quartile3SkewnessOfNumericAtts",
        "value": "1.1194075814602158"
      },
      {
        "name": "Quartile3StdDevOfNumericAtts",
        "value": "9083.777537721406"
      },
      {
        "name": "StdvNominalAttDistinctValues",
        "value": "0.0"
      }
    ]
  }
}