{
  "data_qualities": {
    "quality": [
      {
        "name": "AutoCorrelation",
        "value": "0.7877551020408163"
      },
      {
        "name": "ClassEntropy",
        "value": "0.5464106505273412"
      },
      {
        "name": "Dimensionality",
        "value": "0.028455284552845527"
      },
      {
        "name": "EquivalentNumberOfAtts",
        "value": "32.806996676342635"
      },
      {
        "name": "MajorityClassPercentage",
        "value": "87.39837398373984"
      },
      {
        "name": "MajorityClassSize",
        "value": "215.0"
      },
      {
        "name": "MaxAttributeEntropy",
        "value": "2.2079691100648566"
      },
      {
        "name": "MaxKurtosisOfNumericAtts",
        "value": []
      },
      {
        "name": "MaxMeansOfNumericAtts",
        "value": []
      },
      {
        "name": "MaxMutualInformation",
        "value": "0.0412904738267"
      },
      {
        "name": "MaxNominalAttDistinctValues",
        "value": "7.0"
      },
      {
        "name": "MaxSkewnessOfNumericAtts",
        "value": []
      },
      {
        "name": "MaxStdDevOfNumericAtts",
        "value": []
      },
      {
        "name": "MeanAttributeEntropy",
        "value": "1.5226135498121072"
      },
      {
        "name": "MeanKurtosisOfNumericAtts",
        "value": []
      },
      {
        "name": "MeanMeansOfNumericAtts",
        "value": []
      },
      {
        "name": "MeanMutualInformation",
        "value": "0.016655308497695"
      },
      {
        "name": "MeanNoiseToSignalRatio",
        "value": "90.41911421351506"
      },
      {
        "name": "MeanNominalAttDistinctValues",
        "value": "4.0"
      },
      {
        "name": "MeanSkewnessOfNumericAtts",
        "value": []
      },
      {
        "name": "MeanStdDevOfNumericAtts",
        "value": []
      },
      {
        "name": "MinAttributeEntropy",
        "value": "0.6500224216483541"
      },
      {
        "name": "MinKurtosisOfNumericAtts",
        "value": []
      },
      {
        "name": "MinMeansOfNumericAtts",
        "value": []
      },
      {
        "name": "MinMutualInformation",
        "value": "6.632885052E-5"
      },
      {
        "name": "MinNominalAttDistinctValues",
        "value": "2.0"
      },
      {
        "name": "MinSkewnessOfNumericAtts",
        "value": []
      },
      {
        "name": "MinStdDevOfNumericAtts",
        "value": []
      },
      {
        "name": "MinorityClassPercentage",
        "value": "12.601626016260163"
      },
      {
        "name": "MinorityClassSize",
        "value": "31.0"
      },
      {
        "name": "NumberOfBinaryFeatures",
        "value": "3.0"
      },
      {
        "name": "NumberOfClasses",
        "value": "2.0"
      },
      {
        "name": "NumberOfFeatures",
        "value": "7.0"
      },
      {
        "name": "NumberOfInstances",
        "value": "246.0"
      },
      {
        "name": "NumberOfInstancesWithMissingValues",
        "value": "0.0"
      },
      {
        "name": "NumberOfMissingValues",
        "value": "0.0"
      },
      {
        "name": "NumberOfNumericFeatures",
        "value": "0.0"
      },
      {
        "name": "NumberOfSymbolicFeatures",
        "value": "7.0"
      },
      {
        "name": "PercentageOfBinaryFeatures",
        "value": "42.857142857142854"
      },
      {
        "name": "PercentageOfInstancesWithMissingValues",
        "value": "0.0"
      },
      {
        "name": "PercentageOfMissingValues",
        "value": "0.0"
      },
      {
        "name": "PercentageOfNumericFeatures",
        "value": "0.0"
      },
      {
        "name": "PercentageOfSymbolicFeatures",
        "value": "100.0"
      },
      {
        "name": "Quartile1AttributeEntropy",
        "value": "0.6570375163711129"
      },
      {
        "name": "Quartile1KurtosisOfNumericAtts",
        "value": []
      },
      {
        "name": "Quartile1MeansOfNumericAtts",
        "value": []
      },
      {
        "name": "Quartile1MutualInformation",
        "value": "4.507413361725001E-4"
      },
      {
        "name": "Quartile1SkewnessOfNumericAtts",
        "value": []
      },
      {
        "name": "Quartile1StdDevOfNumericAtts",
        "value": []
      },
      {
        "name": "Quartile2AttributeEntropy",
        "value": "1.7278152837318823"
      },
      {
        "name": "Quartile2KurtosisOfNumericAtts",
        "value": []
      },
      {
        "name": "Quartile2MeansOfNumericAtts",
        "value": []
      },
      {
        "name": "Quartile2MutualInformation",
        "value": "0.014633283618700001"
      },
      {
        "name": "Quartile2SkewnessOfNumericAtts",
        "value": []
      },
      {
        "name": "Quartile2StdDevOfNumericAtts",
        "value": []
      },
      {
        "name": "Quartile3AttributeEntropy",
        "value": "2.17400476632894"
      },
      {
        "name": "Quartile3KurtosisOfNumericAtts",
        "value": []
      },
      {
        "name": "Quartile3MeansOfNumericAtts",
        "value": []
      },
      {
        "name": "Quartile3MutualInformation",
        "value": "0.031869820136795"
      },
      {
        "name": "Quartile3SkewnessOfNumericAtts",
        "value": []
      },
      {
        "name": "Quartile3StdDevOfNumericAtts",
        "value": []
      },
      {
        "name": "StdvNominalAttDistinctValues",
        "value": "2.309401076758503"
      }
    ]
  }
}