{
  "data_qualities": {
    "quality": [
      {
        "name": "AutoCorrelation",
        "value": "0.9999356747716455"
      },
      {
        "name": "ClassEntropy",
        "value": "0.9995621827889447"
      },
      {
        "name": "Dimensionality",
        "value": "0.003923586544027787"
      },
      {
        "name": "EquivalentNumberOfAtts",
        "value": []
      },
      {
        "name": "MajorityClassPercentage",
        "value": "51.23174889046118"
      },
      {
        "name": "MajorityClassSize",
        "value": "7965.0"
      },
      {
        "name": "MaxAttributeEntropy",
        "value": []
      },
      {
        "name": "MaxKurtosisOfNumericAtts",
        "value": "152.28781609775783"
      },
      {
        "name": "MaxMeansOfNumericAtts",
        "value": "0.11411590660577635"
      },
      {
        "name": "MaxMutualInformation",
        "value": []
      },
      {
        "name": "MaxNominalAttDistinctValues",
        "value": "2.0"
      },
      {
        "name": "MaxSkewnessOfNumericAtts",
        "value": "10.46545392014258"
      },
      {
        "name": "MaxStdDevOfNumericAtts",
        "value": "0.08309129515493095"
      },
      {
        "name": "MeanAttributeEntropy",
        "value": []
      },
      {
        "name": "MeanKurtosisOfNumericAtts",
        "value": "12.401602533284594"
      },
      {
        "name": "MeanMeansOfNumericAtts",
        "value": "0.0500000036116655"
      },
      {
        "name": "MeanMutualInformation",
        "value": []
      },
      {
        "name": "MeanNoiseToSignalRatio",
        "value": []
      },
      {
        "name": "MeanNominalAttDistinctValues",
        "value": "2.0"
      },
      {
        "name": "MeanSkewnessOfNumericAtts",
        "value": "1.885088234152945"
      },
      {
        "name": "MeanStdDevOfNumericAtts",
        "value": "0.04136382932843348"
      },
      {
        "name": "MinAttributeEntropy",
        "value": []
      },
      {
        "name": "MinKurtosisOfNumericAtts",
        "value": "0.6553531815997"
      },
      {
        "name": "MinMeansOfNumericAtts",
        "value": "0.012241590017366783"
      },
      {
        "name": "MinMutualInformation",
        "value": []
      },
      {
        "name": "MinNominalAttDistinctValues",
        "value": "2.0"
      },
      {
        "name": "MinSkewnessOfNumericAtts",
        "value": "0.6215557267253506"
      },
      {
        "name": "MinStdDevOfNumericAtts",
        "value": "0.010967097779999083"
      },
      {
        "name": "MinorityClassPercentage",
        "value": "48.76825110953882"
      },
      {
        "name": "MinorityClassSize",
        "value": "7582.0"
      },
      {
        "name": "NumberOfBinaryFeatures",
        "value": "1.0"
      },
      {
        "name": "NumberOfClasses",
        "value": "2.0"
      },
      {
        "name": "NumberOfFeatures",
        "value": "61.0"
      },
      {
        "name": "NumberOfInstances",
        "value": "15547.0"
      },
      {
        "name": "NumberOfInstancesWithMissingValues",
        "value": "14.0"
      },
      {
        "name": "NumberOfMissingValues",
        "value": "280.0"
      },
      {
        "name": "NumberOfNumericFeatures",
        "value": "60.0"
      },
      {
        "name": "NumberOfSymbolicFeatures",
        "value": "1.0"
      },
      {
        "name": "PercentageOfBinaryFeatures",
        "value": "1.639344262295082"
      },
      {
        "name": "PercentageOfInstancesWithMissingValues",
        "value": "0.09004952723998198"
      },
      {
        "name": "PercentageOfMissingValues",
        "value": "0.029524435160649832"
      },
      {
        "name": "PercentageOfNumericFeatures",
        "value": "98.36065573770492"
      },
      {
        "name": "PercentageOfSymbolicFeatures",
        "value": "1.639344262295082"
      },
      {
        "name": "Quartile1AttributeEntropy",
        "value": []
      },
      {
        "name": "Quartile1KurtosisOfNumericAtts",
        "value": "2.7101441306276337"
      },
      {
        "name": "Quartile1MeansOfNumericAtts",
        "value": "0.036699041615745984"
      },
      {
        "name": "Quartile1MutualInformation",
        "value": []
      },
      {
        "name": "Quartile1SkewnessOfNumericAtts",
        "value": "1.2571595073616504"
      },
      {
        "name": "Quartile1StdDevOfNumericAtts",
        "value": "0.0278354342856"
      },
      {
        "name": "Quartile2AttributeEntropy",
        "value": []
      },
      {
        "name": "Quartile2KurtosisOfNumericAtts",
        "value": "5.654035623450659"
      },
      {
        "name": "Quartile2MeansOfNumericAtts",
        "value": "0.050990893639800666"
      },
      {
        "name": "Quartile2MutualInformation",
        "value": []
      },
      {
        "name": "Quartile2SkewnessOfNumericAtts",
        "value": "1.618375288167504"
      },
      {
        "name": "Quartile2StdDevOfNumericAtts",
        "value": "0.04371640430953576"
      },
      {
        "name": "Quartile3AttributeEntropy",
        "value": []
      },
      {
        "name": "Quartile3KurtosisOfNumericAtts",
        "value": "10.997455975154747"
      },
      {
        "name": "Quartile3MeansOfNumericAtts",
        "value": "0.062194010692707344"
      },
      {
        "name": "Quartile3MutualInformation",
        "value": []
      },
      {
        "name": "Quartile3SkewnessOfNumericAtts",
        "value": "2.16019795046747"
      },
      {
        "name": "Quartile3StdDevOfNumericAtts",
        "value": "0.0538596675259876"
      },
      {
        "name": "StdvNominalAttDistinctValues",
        "value": "0.0"
      }
    ]
  }
}