{
  "data_set_description": {
    "citation": "http://citeseerx.ist.psu.edu/viewdoc/download?doi=10.1.1.538.9597&rep=rep1&type=pdf",
    "default_target_attribute": "desert,mountains,sea,sunset,trees",
    "description": "Multi-label dataset. The image benchmark dataset consists of 2000\n  natural scene images. Zhou and Zhang (2007) extracted 135 features for each\n  image and made it publicly available as processed image dataset. Each\n  observation can be associated with different label sets, where all possible\n  labels are {desert, mountains, sea, sunset, trees}. About 22% of the images\n  belong to more than one class. However, images belonging to three classes or\n  more are very rare.",
    "description_version": "1",
    "file_id": "21230425",
    "format": "ARFF",
    "id": "41468",
    "licence": "Public",
    "md5_checksum": "4ff1ed59408dce7aed694f817af78beb",
    "minio_url": "https://data.openml.org/datasets/0004/41468/dataset_41468.pq",
    "name": "image",
    "parquet_url": "https://data.openml.org/datasets/0004/41468/dataset_41468.pq",
    "processing_date": "2019-03-14 17:59:12",
    "status": "active",
    "tag": [
      "2019_multioutput_paper",
      "Computer Vision",
      "Data Science",
      "Machine Learning"
    ],
    "upload_date": "2019-03-14T17:59:04",
    "url": "https://api.openml.org/data/v1/download/21230425/image.arff",
    "version": "3",
    "visibility": "public"
  }
}