{
  "data_set_description": {
    "default_target_attribute": "label",
    "description": "It has 3 attributes (ID, tweet, label ) 91299 tweets with non-sarcastic 39998 tweets and 51300 sarcastic tweets.",
    "description_version": "1",
    "file_id": "21230272",
    "format": "ARFF",
    "id": "41463",
    "licence": "CC0",
    "md5_checksum": "974cd0073c86ecf229191fcb9251b944",
    "minio_url": "https://data.openml.org/datasets/0004/41463/dataset_41463.pq",
    "name": "sarcasm_detection",
    "parquet_url": "https://data.openml.org/datasets/0004/41463/dataset_41463.pq",
    "processing_date": "2019-02-23 10:19:03",
    "row_id_attribute": "ID",
    "status": "active",
    "upload_date": "2019-02-23T10:18:41",
    "url": "https://api.openml.org/data/v1/download/21230272/sarcasm_detection.arff",
    "version": "1",
    "version_label": "1",
    "visibility": "public"
  }
}