{
  "data_features": {
    "feature": [
      {
        "data_type": "numeric",
        "index": "0",
        "is_ignore": "false",
        "is_row_identifier": "false",
        "is_target": "false",
        "name": "attribute_0",
        "number_of_missing_values": "0"
      },
      {
        "data_type": "nominal",
        "index": "1",
        "is_ignore": "false",
        "is_row_identifier": "false",
        "is_target": "false",
        "name": "attribute_1",
        "nominal_value": [
          "114.916",
          "126.41",
          "233.446",
          "245.796",
          "366.024",
          "40.434",
          "402.636",
          "44.478",
          "542.65",
          "596.93"
        ],
        "number_of_missing_values": "0"
      }
    ]
  }
}