{
  "data_set_description": {
    "creator": "Prathap",
    "description": "Sample data check",
    "description_version": "1",
    "file_id": "20693708",
    "format": "ARFF",
    "id": "41416",
    "licence": "CC0",
    "md5_checksum": "d174598eb9b24a088513b46def9e9820",
    "minio_url": "https://data.openml.org/datasets/0004/41416/dataset_41416.pq",
    "name": "SampleFile",
    "parquet_url": "https://data.openml.org/datasets/0004/41416/dataset_41416.pq",
    "processing_date": "2018-12-07 14:08:49",
    "status": "in_preparation",
    "upload_date": "2018-12-07T14:08:24",
    "url": "https://api.openml.org/data/v1/download/20693708/SampleFile.arff",
    "version": "1",
    "version_label": "1",
    "visibility": "public"
  }
}