"id","es","volume","rvol","vix","vx2","vx3","vx4","vix_max","return","vix_d_1","vix_d_2","vix_d_3","vix_d_4","vix_d_5","vix_delta","vix_bin","riskoff"
1,2749.554348,48836.86957,4.476626087,9.610714286,11.63607724,12.44226457,13.16264591,10.08,0.002065708,0.035714286,0.187857143,0.351957938,0.257936508,0.186022397,0.469285714,10,0
2,2747.119565,54721,5.936856522,10.18785714,11.72569808,12.49344512,13.18440095,10.58,-0.000885911,0.577142857,0.306428571,0.3677263,0.279820293,0.218740894,0.392142857,15,0
3,2756.978261,43896.47826,6.478995833,9.778571429,11.50985495,12.27526205,12.96450382,9.9,0.003582315,-0.409285714,0.083928571,0.340420241,0.264714982,0.214863062,0.121428571,10,0
4,2776.090909,58845.27273,6.226030435,9.987142857,11.48932087,12.26682953,12.92520776,10.24,0.006908543,0.208571429,-0.100357143,0.346389199,0.26076091,0.216288963,0.252857143,10,0
5,2793.923913,77564.26087,6.233717391,11.04857143,11.71980656,12.45611052,13.08635824,12.01,0.006403238,1.061428571,0.635,0.361494777,0.287402453,0.23077956,0.961428571,15,0
6,2791.076087,62679.13043,9.08566087,11.61714286,12.18894492,13.18723176,13.678125,12.75,-0.001019812,0.568571429,0.815,0.396006818,0.285073266,0.241753995,1.132857143,15,0
7,2802.782609,53204.47826,9.237143478,11.96428571,12.66615721,13.24963168,13.75352423,12.22,0.004185497,0.347142857,0.457857143,0.399322939,0.305880205,0.234873449,0.255714286,15,0
8,2801.409091,58351.5,8.380868182,11.79785714,12.67287549,13.25117146,13.74434447,12.27,-0.000490175,-0.166428571,0.090357143,0.355939143,0.295326134,0.241300219,0.472142857,15,0
9,2815.25,47557.73913,7.271417391,11.27071429,12.52183426,13.1611991,13.69381818,11.59,0.00492853,-0.527142857,-0.346785714,0.323393179,0.255026506,0.225704477,0.319285714,15,0
10,2836.521739,89672.17391,12.2084375,14.45285714,14.02128302,14.47057143,14.86006679,14.91,0.007527494,3.182142857,1.3275,0.402666667,0.311024348,0.261623998,0.457142857,15,1
11,2830.25,77449.95652,11.44483478,14.03285714,13.79417108,14.24980127,14.65087719,14.35,-0.002213515,-0.42,1.381071429,0.396480394,0.293223881,0.241588785,0.317142857,15,1
12,2829.663043,69628.91304,11.29468261,13.25642857,13.43782946,13.954971,14.40683003,14.06,-0.000207408,-0.776428571,-0.598214286,0.392061178,0.28090755,0.2216,0.803571429,15,1
13,2801.011364,110009.9091,11.41553636,15.24,13.74769874,14.18508621,14.63824701,17.45,-0.010177085,1.983571429,0.603571429,0.351487595,0.338044236,0.258352001,2.21,20,1
14,2728.717391,170382.087,17.47275,21.68357143,16.47325499,16.11392544,16.13467095,37.32,-0.026148875,6.443571429,4.213571429,0.51506668,0.375074133,0.384777236,15.63642857,25,1
15,2618.858696,202590.2174,51.24540435,37.43642857,22.64469803,20.91534653,19.86146953,49.21,-0.041093068,15.75285714,11.09821429,0.94134023,0.66694238,0.518048829,11.77357143,30,0
16,2683.25,105974.3043,51.6131087,26.88142857,19.67349229,19.0085976,18.53807107,31.26,0.024290136,-10.555,2.598928571,0.587957755,0.506950806,0.383121246,4.378571429,30,0
17,2651.076087,133317.7826,43.3456,29.37214286,20.34512281,19.51172096,19.02306003,35.81,-0.012063118,2.490714286,-4.032142857,0.451526831,0.48182649,0.4431381,6.437857143,30,0
18,2597.795455,171520.7727,39.9844,32.27,21.85544244,20.59725059,19.91516361,37.44,-0.020302445,2.897857143,2.694285714,0.28733154,0.372055868,0.423490814,5.17,30,0
19,2644.51087,90814.47826,35.10236087,26.56642857,20.2641637,19.01871814,18.45459952,28.17,0.017822939,-5.703571429,-1.402857143,0.329427291,0.177410276,0.245037388,1.603571429,30,0
20,2650.25,61949.52174,26.52018261,26.25285714,20.32933381,19.28052091,18.81906883,27.19,0.002167853,-0.313571429,-3.008571429,0.29793374,0.244154222,0.140253,0.937142857,30,0
21,2673.336957,87949.30435,20.32935217,21.33642857,19.03682055,18.22421746,17.9527193,24.68,0.008673513,-4.916428571,-2.615,0.220394882,0.18160429,0.158744752,3.343571429,25,0
22,2712.945652,70606.08696,19.23165217,18.98357143,17.50223316,17.55636918,17.40616822,20.22,0.014707513,-2.352857143,-3.634642857,0.238189982,0.147068263,0.129262421,1.236428571,20,0
23,2737.75,76033.31818,17.73828696,18.88071429,17.28685185,17.27378774,17.13551351,20.31,0.009101414,-0.102857143,-1.227857143,0.239729009,0.177674562,0.117017132,1.429285714,20,0
24,2724.369565,53311.52174,13.4831913,20.645,17.78568093,17.69834996,17.54324444,21.23,-0.004899366,1.764285714,0.830714286,0.322531329,0.196597649,0.155421719,0.585,25,0
25,2716.48913,68942.69565,13.76565652,19.50142857,17.80649592,17.66675354,17.45179196,20.94,-0.002896763,-1.143571429,0.310357143,0.342426409,0.228499213,0.148566142,1.438571429,20,0
26,2701.869565,68025.13043,17.70204783,19.52571429,18.06273621,17.91427492,17.69020661,20.48,-0.005396321,0.024285714,-0.559642857,0.344720614,0.257139632,0.183027016,0.954285714,20,0
27,2723.556818,54387.31818,15.69635652,17.77642857,17.46011561,17.41157982,17.26715226,18.71,0.007994715,-1.749285714,-0.8625,0.287017495,0.235378126,0.187282237,0.933571429,20,0
28,2760.695652,52264.34783,13.69371304,16.325,16.52538776,16.62551188,16.58065589,16.52,0.013544016,-1.451428571,-1.600357143,0.279039387,0.197687091,0.17292778,0.195,20,0
29,2772.641304,73547.82609,10.81905652,17.02357143,16.60097886,16.68392283,16.68237822,18.96,0.004317709,0.698571429,-0.376428571,0.290617988,0.218234928,0.164917137,1.936428571,20,0
30,2744.728261,77156.73913,13.434,18.57714286,17.36117965,17.24615385,17.09162437,20.4,-0.01011833,1.553571429,1.126071429,0.348347866,0.237854843,0.190520841,1.822857143,20,0
31,2702.869565,119893.3478,19.38015652,21.49428571,18.22201188,17.96865227,17.71822504,24.36,-0.015368065,2.917142857,2.235357143,0.438882812,0.302286334,0.220163886,2.865714286,25,0
32,2672.909091,95934.77273,21.6586,22.79357143,18.93940092,18.5539484,18.277201,25.94,-0.011146584,1.299285714,2.108214286,0.446313934,0.349059287,0.256447141,3.146428571,25,0
33,2691.728261,74550.26087,21.63401304,19.475,18.34753731,18.17860863,17.9869038,20.8,0.007016037,-3.318571429,-1.009642857,0.349443761,0.286000504,0.238591118,1.325,20,0
34,2722.26087,64242,18.01350435,18.355,17.88645754,17.80827533,17.65529974,19.52,0.011279274,-1.12,-2.219285714,0.284649298,0.247010535,0.215642177,1.165,20,0
35,2704.891304,75990.95652,20.58591739,19.22214286,18.47706355,18.34728938,18.15422153,20.32,-0.006401009,0.867142857,-0.126428571,0.281104739,0.22357271,0.206944017,1.097857143,20,0
36,2728.097826,64371.08696,16.46498696,17.21285714,17.63033157,17.74645335,17.69765555,17.61,0.008542871,-2.009285714,-0.571071429,0.294614585,0.188790699,0.160162169,0.397142857,20,0
37,2752.534091,67607.95455,13.07287826,15.63642857,16.98672496,17.29919872,17.35134549,16.43,0.008917376,-1.576428571,-1.792857143,0.283963109,0.200724372,0.137200338,0.793571429,20,0
38,2789.706522,52317.69565,10.64616087,15.71714286,16.34120923,16.71624593,16.82662037,16.11,0.013414426,0.080714286,-0.747857143,0.272552736,0.214071682,0.161408399,0.392857143,20,0
39,2781.51087,52372.43478,9.218156522,15.87428571,16.62561807,16.99412021,17.09748768,16.56,-0.002942143,0.157142857,0.118928571,0.307411403,0.206458326,0.172969607,0.685714286,20,0
40,2763.130435,32452.21739,9.989395652,16.57357143,16.91868607,17.23476466,17.28402647,17.23,-0.006630006,0.699285714,0.428214286,0.353311102,0.240714997,0.172442496,0.656428571,20,0
41,2751.956522,15029.82609,11.73484783,16.82642857,16.98499613,17.31502008,17.37082524,17.28,-0.004052131,0.252857143,0.476071429,0.356859359,0.269026084,0.195510001,0.453571429,20,0
42,2751.142857,3238.428571,10.99854091,15.91785714,16.56333605,16.9534632,17.07864271,16.71,-0.000295711,-0.908571429,-0.327857143,0.33424826,0.253192601,0.203599653,0.792142857,20,0
43,2732.891304,84388.86957,10.42734583,18.29642857,17.12769231,17.31460537,17.35667854,20.49,-0.006656275,2.378571429,0.735,0.367984025,0.288145698,0.232821305,2.193571429,20,0
44,2722.291667,44963.41667,11.00509583,18.59142857,17.54425203,17.54804069,17.50396367,19.08,-0.003886085,0.295,1.336785714,0.36829817,0.280437874,0.234233261,0.488571429,20,0
45,2722.967391,60487.04348,10.3780087,17.63,17.26021423,17.23391916,17.52122642,18.16,0.000248188,-0.961428571,-0.333214286,0.369187047,0.261939126,0.212748352,0.53,20,0
46,2689.391304,110378.2174,13.72458261,20.60285714,17.83416342,17.71463415,17.93720137,23.41,-0.012407351,2.972857143,1.005714286,0.375352983,0.323580884,0.24488687,2.807142857,25,0
47,2629.690476,129891.0952,21.45717727,23.82785714,18.67632637,18.26186848,18.37575377,25.65,-0.022448737,3.225,3.098928571,0.427219405,0.325580714,0.299385237,1.822142857,25,0
48,2629.358696,94708.69565,27.9191913,22.355,18.67998528,18.29153046,18.45149626,23.34,-0.000126175,-1.472857143,0.876071429,0.422669692,0.30060896,0.24436463,0.985,25,0
49,2658.673913,103375.3478,24.282,20.87428571,18.75716925,18.38374532,18.56984193,22.77,0.011087495,-1.480714286,-1.476785714,0.337724772,0.296005186,0.224558168,1.895714286,25,0
50,2613,118420.1304,23.21278696,22.995,19.58627959,19.09331116,19.22734187,24.26,-0.017328483,2.120714286,0.32,0.321682305,0.279026834,0.260862167,1.265,25,0
51,2621.22619,92566.33333,18.95440909,21.18571429,19.46627814,19.0205763,19.19391489,22.71,0.003143233,-1.809285714,0.155714286,0.315898222,0.222278845,0.205658022,1.524285714,25,0
52,2613.043478,101169.8261,19.28504783,22.30428571,19.61412387,19.10845791,19.25555556,24.89,-0.003126594,1.118571429,-0.345357143,0.356168446,0.249432853,0.187211847,2.585714286,25,0
53,2592.206522,93227.78261,20.6826913,22.29571429,19.83231343,19.25075019,19.38674804,23.21,-0.008006174,-0.008571429,0.555,0.323196554,0.267023679,0.199469598,0.914285714,25,0
54,2606.195652,94931.6087,19.6371,22.36,20.08796649,19.49961509,19.63139636,24.39,0.005382102,0.064285714,0.027857143,0.351809395,0.243096325,0.214234875,2.03,25,0
55,2657.141304,72442.78261,20.0153913,19.54071429,19.02213053,18.72327454,18.92667231,20.03,0.019359294,-2.819285714,-1.3775,0.292032281,0.230588334,0.169956202,0.489285714,20,0
56,2631.345238,115168.3333,22.81550909,20.66142857,19.37958199,19.06900894,19.22738397,22.61,-0.009755634,1.120714286,-0.849285714,0.308899853,0.231585858,0.195050573,1.948571429,25,0
57,2625.347826,74341.26087,24.46323913,20.99428571,19.36077491,19.03604294,19.1978671,21.9,-0.00228182,0.332857143,0.726785714,0.312973848,0.235407189,0.188253379,0.905714286,25,0
58,2648.391304,84323.17391,25.18578696,20.76857143,19.38024872,19.03677991,19.20398916,21.49,0.008739008,-0.225714286,0.053571429,0.354278612,0.232206747,0.186301019,0.721428571,25,0
59,2643.445652,68540.91304,20.22708261,20.54428571,19.55719697,19.21447574,19.37884956,21.33,-0.001869163,-0.224285714,-0.225,0.331443453,0.262839493,0.183759264,0.785714286,25,0
60,2654.695652,55117.43478,16.73776522,19.10428571,19.1188764,18.97396313,19.17618432,19.84,0.004246779,-1.44,-0.832142857,0.303325168,0.231158819,0.195533136,0.735714286,20,0
61,2663.02381,77340.57143,15.26527273,17.82428571,18.5230834,18.52749554,18.76513026,18.2,0.003132231,-1.28,-1.36,0.286077865,0.212251633,0.172536818,0.375714286,20,0
62,2673.434783,50842.3913,15.08892174,16.945,17.63424401,17.8641261,18.16653543,17.47,0.003901833,-0.879285714,-1.079642857,0.27493452,0.203974068,0.161424878,0.525,20,0
63,2697.543478,52924.73913,12.00021304,15.54428571,16.85168792,17.20935765,17.59896324,16.16,0.008977455,-1.400714286,-1.14,0.271218126,0.189155831,0.149690466,0.615714286,20,0
64,2712.25,44654.17391,8.652717391,15.56642857,16.51442673,17.16437908,17.41147687,16.4,0.005437013,0.022142857,-0.689285714,0.291108974,0.203703358,0.151540227,0.833571429,20,0
65,2701.130435,66523.95652,7.089130435,16.005,16.77815768,17.18699046,17.39594852,16.74,-0.004108184,0.438571429,0.230357143,0.314842136,0.224483049,0.167554027,0.735,20,0
66,2685.666667,74643.7619,8.149504545,16.39857143,16.88504595,17.25687876,17.42440476,17.11,-0.005741375,0.393571429,0.416071429,0.351652728,0.241938203,0.184002565,0.711428571,20,0
67,2673.565217,51897.13043,9.871230435,16.805,16.9364486,17.28175896,17.44297778,17.48,-0.004516121,0.406428571,0.4,0.359855611,0.270276169,0.198347595,0.675,20,0
68,2664.565217,100170.913,12.37746087,16.83785714,17.02671451,17.33866878,17.46934046,19.09,-0.00337197,0.032857143,0.219642857,0.350679103,0.270419401,0.216643691,2.252142857,20,0
69,2632.152174,80878.82609,16.09831739,18.51142857,17.61336634,17.73292496,17.73373048,19.6,-0.01223907,1.673571429,0.853214286,0.376281325,0.289150712,0.237837838,1.088571429,20,0
70,2655.891304,54072.13043,16.1446913,17.15714286,17.30326923,17.5196258,17.60607143,18.1,0.008978478,-1.354285714,0.159642857,0.340318216,0.261564596,0.214397287,0.942857143,20,0
71,2669,52895.7619,13.81922273,16.01571429,17.00628743,17.30522388,17.43592939,16.65,0.004923564,-1.141428571,-1.247857143,0.317057651,0.238258171,0.195330604,0.634285714,20,0
72,2669.380435,55764.82609,10.8141913,15.59285714,16.69812344,17.07951356,17.26031106,16.08,0.000142528,-0.422857143,-0.782142857,0.280778927,0.231514869,0.185574021,0.487142857,20,0
73,2646.086957,55871.21739,10.65805652,15.99857143,16.82072667,17.18200893,17.34465,16.64,-0.00876447,0.405714286,-0.008571429,0.310824313,0.216063436,0.190030968,0.641428571,20,0
74,2646.358696,59737.52174,10.82086957,15.36785714,16.4769835,16.854,17.02594021,15.97,0.000102689,-0.630714286,-0.1125,0.319849553,0.223927977,0.166036425,0.602142857,20,0
75,2625.945652,90608.3913,14.12921739,16.32571429,16.74779051,17.10090361,17.26979487,18.53,-0.007743538,0.957857143,0.163571429,0.348999847,0.254838997,0.190308077,2.204285714,20,0
76,2637.738095,77024.09524,17.76674091,15.53785714,16.58112245,16.92809187,17.07240161,16.33,0.004480688,-0.787857143,0.085,0.323734262,0.249118186,0.194032647,0.792142857,20,0
77,2671.554348,47864.04348,15.00643913,15.05071429,16.28142055,16.69776182,16.89028067,15.4,0.012738688,-0.487142857,-0.6375,0.326454412,0.23518841,0.193046267,0.349285714,20,0
78,2666.326087,53982.6087,11.39770435,14.97571429,16.36144975,16.76493739,16.95964247,15.28,-0.001958928,-0.075,-0.281071429,0.305769455,0.24362073,0.187213144,0.304285714,15,0
79,2681.51087,52932.52174,9.965978261,14.07785714,16.01842526,16.44493945,16.69354839,14.47,0.005678866,-0.897857143,-0.486428571,0.302011983,0.215577966,0.183211713,0.392142857,15,0
80,2707.554348,49969.26087,9.290430435,13.29857143,15.37966102,15.95149912,16.29053611,13.55,0.00966538,-0.779285714,-0.838571429,0.294528024,0.213970487,0.162915646,0.251428571,15,0
81,2723.380952,48602.28571,8.548877273,13.10357143,15.00065274,15.52865916,15.9055814,13.31,0.005828333,-0.195,-0.487142857,0.291662692,0.217656969,0.168666391,0.206428571,15,0
82,2734.5,39793.21739,7.504882609,13.03071429,14.45831954,15.02107843,15.437964,13.18,0.004074498,-0.072857143,-0.133928571,0.308539246,0.217530764,0.17315742,0.149285714,15,0
83,2717.456522,64845.65217,7.618343478,13.93,14.85270898,15.30777311,15.68572139,14.76,-0.006252263,0.899285714,0.413214286,0.349160311,0.247374296,0.186034532,0.83,15,0
84,2715.108696,44771.21739,9.72383913,13.93214286,15.28652672,15.72439926,16.12977737,14.68,-0.000864353,0.002142857,0.450714286,0.354410829,0.261910517,0.19792988,0.747857143,15,0
85,2720.836957,45634.82609,9.831430435,13.415,15.22173129,15.65342081,16.08356164,13.64,0.00210755,-0.517142857,-0.2575,0.343163588,0.255941673,0.201750994,0.225,15,0
86,2719.916667,46361.71429,9.849127273,13.40642857,15.0858428,15.5342661,16.00380849,13.74,-0.000338295,-0.008571429,-0.262857143,0.320804704,0.257208244,0.204622513,0.333571429,15,0
87,2730.576087,38653.95652,10.31967391,13.15357143,14.81357504,15.29936399,15.78713745,13.41,0.003911365,-0.252857143,-0.130714286,0.314705631,0.236065532,0.201885655,0.256428571,15,0
88,2733.48913,37536.95652,8.113817391,13.02642857,14.76969006,15.22569089,15.7204978,13.25,0.001066255,-0.127142857,-0.19,0.323678185,0.233747757,0.187026972,0.223571429,15,0
89,2717.934783,55049.21739,7.968221739,13.76071429,15.09679123,15.53548681,16.0388668,14.51,-0.005706542,0.734285714,0.303571429,0.342142185,0.256442681,0.197539093,0.749285714,15,0
90,2725.836957,53179.3913,9.941956522,12.95214286,14.76640034,15.24344894,15.7568434,14.17,0.0029032,-0.808571429,-0.037142857,0.328228799,0.241528584,0.193099409,1.217857143,15,0
91,2727.011905,45638.14286,10.62477273,12.92357143,14.59282342,15.10226537,15.64886499,13.32,0.000430948,-0.028571429,-0.418571429,0.330701321,0.245628564,0.192796633,0.396428571,15,0
92,2701.586957,79377.73913,9.75806087,16.07642857,15.44093679,15.73736756,16.15677507,18.36,-0.009367107,3.152857143,1.562142857,0.389428151,0.308534847,0.244442031,2.283571429,20,0
93,2707.25,60146.43478,12.26722609,15.57571429,15.73938485,15.92203526,16.22350937,16.49,0.002093998,-0.500714286,1.326071429,0.400852957,0.282974306,0.239140209,0.914285714,20,0
94,2717.663043,70149.86957,11.21156087,15.16642857,15.69955065,16.02463457,16.39559242,16.01,0.003838976,-0.409285714,-0.455,0.391182594,0.292739756,0.220430833,0.843571429,20,0
95,2720.880952,55106.85714,10.70231818,14.02,15.44333888,15.79068034,16.19673913,14.82,0.001183372,-1.146428571,-0.777857143,0.290694747,0.27120986,0.216489274,0.8,15,0
96,2742.521739,35837.95652,8.212165217,13.23714286,14.88741857,15.29026906,15.78125,13.68,0.007922132,-0.782857143,-0.964642857,0.283285946,0.20584707,0.204852705,0.442857143,15,0
97,2747.1875,40408.875,6.872978261,12.70642857,14.63759214,15.08316652,15.57941176,13.1,0.001699821,-0.530714286,-0.656785714,0.27926655,0.203946162,0.158075265,0.393571429,15,0
98,2759.195652,56420.91304,6.303626087,12.04214286,14.31991042,14.8194788,15.31364692,12.45,0.004361546,-0.664285714,-0.5975,0.286308675,0.198499976,0.154627167,0.407857143,15,0
99,2772.869565,75752.78261,6.870213043,12.08071429,14.11062257,14.66854334,15.17014778,13.01,0.004943521,0.038571429,-0.312857143,0.304212533,0.215419299,0.159308623,0.929285714,15,0
100,2768.25,61277.2381,7.76415,12.66714286,14.36710635,14.90051163,15.38188477,13.27,-0.001667377,0.586428571,0.3125,0.332302734,0.239234837,0.180701039,0.602857143,15,0
101,2780.945652,51159.95652,7.529356522,12.42857143,14.14024194,14.74332461,15.25587558,12.65,0.004575681,-0.238571429,0.173928571,0.344029895,0.244533138,0.187783294,0.221428571,15,0
102,2784.782609,41012.91304,7.16376087,12.30642857,13.95826155,14.64373964,15.21774662,12.54,0.00137878,-0.122142857,-0.180357143,0.339561284,0.255486684,0.193703974,0.233571429,15,0
103,2785.902174,25439.91304,6.832682609,12.29071429,13.872284,14.56806482,15.17286013,12.94,0.000401949,-0.015714286,-0.068928571,0.323427691,0.25434577,0.204128359,0.649285714,15,0
104,2777.847826,15525.08696,6.995373913,12.42,13.88421257,14.54643788,15.16387833,12.92,-0.002895297,0.129285714,0.056785714,0.333103448,0.245122364,0.205616981,0.5,15,0
105,2777.428571,3068.785714,7.581277273,12.38642857,13.81614274,14.48923221,15.13920751,12.75,-0.000150939,-0.033571429,0.047857143,0.335500222,0.249152299,0.195567836,0.363571429,15,0
106,2771.913043,42788.47826,9.006856522,12.85928571,13.91090551,14.48036472,15.09387255,13.33,-0.001987814,0.472857143,0.219642857,0.348753414,0.261231064,0.206931034,0.470714286,15,0
107,2756.532609,68039.3913,10.2662087,13.93,14.46170213,14.84151515,15.3590448,14.42,-0.005564123,1.070714286,0.771785714,0.373859367,0.283343988,0.226385745,0.49,15,0
108,2771.804348,44964.17391,9.262226087,12.70357143,14.26577726,15.14809437,15.6997996,12.97,0.005524909,-1.226428571,-0.077857143,0.34186802,0.25570796,0.206718196,0.266428571,15,0
109,2766.652174,63353.26087,9.473817391,13.76285714,14.84281201,15.34399671,15.86852022,14.74,-0.001860509,1.059285714,-0.083571429,0.356755356,0.277780981,0.221624109,0.977142857,15,0
110,2761.738095,50787.85714,9.014931818,13.59642857,14.96520068,15.42864209,15.91114017,14.06,-0.001777762,-0.166428571,0.446428571,0.325351246,0.264330945,0.219537512,0.463571429,15,0
111,2734.173913,93354.43478,10.15338696,16.43571429,15.74445719,16.04317269,16.45101054,19.11,-0.010030879,2.839285714,1.336428571,0.4312623,0.294969747,0.255624063,2.674285714,20,0
112,2724.706522,59495.52174,12.8877913,16.42714286,16.0929878,16.37559904,16.72752137,17.36,-0.003468624,-0.008571429,1.415357143,0.39786174,0.323278043,0.235852733,0.932857143,20,0
113,2721.369565,90231.13043,13.68976522,16.65642857,16.33006065,16.59421053,16.946,17.98,-0.001225454,0.229285714,0.110357143,0.408353034,0.302561241,0.262232218,1.323571429,20,0
114,2711.423913,71985.82609,14.94674783,17.46071429,16.7332342,16.9415979,17.24083267,18.49,-0.003661344,0.804285714,0.516785714,0.354121396,0.321053323,0.253736766,1.029285714,20,0
115,2730.714286,73813.09524,14.09169545,15.59642857,16.21313629,16.52275,16.88340767,16.18,0.007089292,-1.864285714,-0.53,0.316476795,0.237233811,0.22941949,0.583571429,20,0
116,2714.695652,50935.26087,13.98545217,17.00142857,16.68879112,16.94969605,17.29093199,17.84,-0.00588337,1.405,-0.229642857,0.340237575,0.25873989,0.206883963,0.838571429,20,0
117,2727.675,41470.95,11.87805,15.31,16.25365194,16.62457786,17.02522568,16.22,0.00476975,-1.691428571,-0.143214286,0.292275176,0.229791157,0.186398817,0.91,20,0
118,2726.815217,45514.04348,9.679295652,15.25571429,16.30447427,16.63918813,17.03876404,16.11,-0.000315257,-0.054285714,-0.872857143,0.326051446,0.218429127,0.183181097,0.854285714,20,0
119,2746.071429,58063.19048,10.37836818,14.26071429,15.96223748,16.37462562,16.83606921,15.23,0.007036978,-0.995,-0.524642857,0.279598353,0.228589421,0.163346288,0.969285714,15,0
120,2777.695652,41038.08696,9.001534783,13.01857143,14.98235759,15.54516529,16.09644309,13.38,0.011450363,-1.242142857,-1.118571429,0.28344375,0.191433493,0.166942981,0.361428571,15,0
121,2790.75,41772.47826,7.494917391,12.56142857,14.59196787,15.15586003,15.7359454,13.02,0.004688695,-0.457142857,-0.849642857,0.274463901,0.205118037,0.147769095,0.458571429,15,0
122,2776.728261,55349.3913,9.220095652,13.69285714,14.95515813,15.43522377,15.97360642,13.99,-0.005037027,1.131428571,0.337142857,0.320060105,0.224388988,0.178874685,0.297142857,15,0
123,2789.815217,47831.13043,8.124552174,12.87142857,14.55595145,15.09878458,15.69029081,13.15,0.004702013,-0.821428571,0.155,0.329565822,0.225644879,0.168742392,0.278571429,15,0
124,2802.654762,42493.80952,7.412113636,12.46428571,14.39483216,14.94928298,15.54537037,12.93,0.004591734,-0.407142857,-0.614285714,0.330755525,0.239355865,0.17480591,0.465714286,15,0
125,2802.228261,33809.13043,6.352426087,12.62428571,14.16027961,14.78269058,15.44270613,12.95,-0.000152189,0.16,-0.123571429,0.307320466,0.251250995,0.193942719,0.325714286,15,0
126,2801.554348,44357.04348,6.594478261,12.50928571,14.18310023,14.83834305,15.48142999,13.09,-0.000240521,-0.115,0.0225,0.323954865,0.228390715,0.199169794,0.580714286,15,0
127,2813.717391,36127.86957,6.231226087,11.98714286,14.36346922,15.52297535,15.80951904,12.31,0.004332137,-0.522142857,-0.318571429,0.320573066,0.232824639,0.175086072,0.322857143,15,0
128,2810.065217,46112.3913,5.620365217,12.66071429,14.94900777,15.63223496,15.86657783,12.94,-0.001298832,0.673571429,0.075714286,0.334295198,0.253939828,0.19672586,0.279285714,15,0
129,2803.130952,46243.95238,8.565677273,12.95571429,15.06008439,15.73333333,15.9503642,13.43,-0.002470702,0.295,0.484285714,0.345229258,0.256563313,0.207885387,0.474285714,15,0
130,2802.271739,35047.3913,7.7372,13.06,15.11300746,15.77685433,16.00484032,13.45,-0.000306566,0.104285714,0.199642857,0.363166885,0.26100611,0.206902795,0.39,15,0
131,2819.076087,57162.82609,6.81443913,12.36214286,14.87279108,15.56226994,15.82502518,12.86,0.005978779,-0.697857143,-0.296785714,0.325472496,0.25782088,0.197647462,0.497857143,15,0
132,2825.260417,53877.16667,6.5192,12.335,14.97296849,15.65004355,15.88242268,12.63,0.002191341,-0.027142857,-0.3625,0.317363179,0.243568406,0.205803837,0.295,15,0
133,2837.619565,42931,8.381895652,12.28285714,14.91725322,15.62668142,15.86437768,12.5,0.004364976,-0.052142857,-0.039642857,0.31349814,0.237016209,0.19403103,0.217142857,15,0
134,2835.619048,69005.95238,8.14935,12.63857143,14.92097538,15.64119923,15.90736096,13.84,-0.000705247,0.355714286,0.151785714,0.340786965,0.241932837,0.195104201,1.201428571,15,0
135,2810.478261,49907.86957,10.18561739,13.75642857,15.29123026,15.9273224,16.13147936,14.26,-0.008905604,1.117857143,0.736785714,0.371745131,0.278196683,0.210665062,0.503571429,15,0
136,2812.206522,57956.82609,8.686126087,13.48785714,15.27885391,15.8872807,16.07179359,13.98,0.000614746,-0.268571429,0.424642857,0.366034737,0.273365568,0.218212284,0.492142857,15,0
137,2815.76087,45490.6087,9.7263,13.05285714,15.08881524,15.73449683,15.93621542,13.24,0.001263102,-0.435,-0.351785714,0.344259824,0.265672249,0.211639354,0.187142857,15,0
138,2811.23913,52578.3913,8.359191304,13.38285714,15.21880276,15.87165685,16.04545889,14.39,-0.001607158,0.33,-0.0525,0.324281288,0.264722505,0.217911142,1.007142857,15,0
139,2830.654762,41248.61905,7.985886364,11.98357143,14.83125628,15.55963542,15.76818182,12.4,0.006882692,-1.399285714,-0.534642857,0.296157037,0.217781297,0.189634904,0.416428571,15,0
140,2844.097826,33465.73913,6.6044,11.63785714,14.63271657,15.4111166,15.65947996,12.1,0.004737859,-0.345714286,-0.8725,0.297198205,0.215709898,0.169198816,0.462142857,15,0
141,2856.706522,33119.82609,5.48023913,11.02428571,14.19331046,15.0126073,15.32853801,11.13,0.004423487,-0.613571429,-0.479642857,0.274587247,0.211146985,0.163469788,0.105714286,15,0
142,2858.336957,31300.04348,4.544682609,10.84642857,13.95784314,14.79242273,15.16649775,11.11,0.000570577,-0.177857143,-0.395714286,0.301702728,0.202617955,0.166192405,0.263571429,15,0
143,2856.619565,29994.69565,4.567734783,10.85,13.94451754,14.81211823,15.1708982,11.27,-0.000601016,0.003571429,-0.087142857,0.310767405,0.226351553,0.162147737,0.42,15,0
144,2840.678571,64334.2381,5.813709091,12.63,14.48188908,15.26633955,15.51759747,13.53,-0.005595998,1.78,0.891785714,0.381884152,0.271312834,0.21078858,0.9,15,0
145,2827.913043,54261.86957,8.578113043,14.27642857,15.06301059,15.68490866,15.82484716,14.96,-0.004503958,1.646428571,1.713214286,0.438744375,0.323749514,0.245344627,0.683571429,15,0
146,2835.826087,43852.43478,9.309326087,13.55,14.95311526,15.56350245,15.75576208,13.9,0.002794284,-0.726428571,0.46,0.416282642,0.312314784,0.245820915,0.35,15,0
147,2826.228261,78757.6087,8.941178261,14.97357143,15.27170264,15.77206531,15.92129799,16.67,-0.003390231,1.423571429,0.348571429,0.395185311,0.345013167,0.276101416,1.696428571,15,0
148,2835.978261,54147.17391,10.02536957,13.54,14.90164794,15.43788122,15.65858762,14.32,0.003443891,-1.433571429,-0.005,0.316138824,0.268012668,0.249585253,0.78,15,0
149,2844.928571,55024.7619,8.603681818,13.15642857,14.71734007,15.28850093,15.56685393,13.66,0.003151017,-0.383571429,-0.908571429,0.323651379,0.230387252,0.208336161,0.503571429,15,0
150,2855.663043,34074.78261,8.206134783,12.52,14.19917062,14.89085884,15.27013052,12.67,0.003766095,-0.636428571,-0.51,0.278713288,0.23099631,0.175394006,0.15,15,0
151,2861.576087,46330.52174,6.26996087,12.40214286,14.22403771,14.90973333,15.26287234,12.86,0.002068497,-0.117857143,-0.377142857,0.305321094,0.207067214,0.183057459,0.457857143,15,0
152,2858.73913,40796.34783,7.332643478,12.57428571,14.83083397,15.38421517,15.55028571,13.14,-0.000991888,0.172142857,0.027142857,0.318584071,0.232169234,0.16795306,0.565714286,15,0
153,2860.26087,44946,6.117291304,12.17214286,15.0410461,15.37978723,15.53581921,12.53,0.00053217,-0.402142857,-0.115,0.324071961,0.231296487,0.179795315,0.357857143,15,0
154,2866.678571,46846.71429,5.777154545,12.01571429,15,15.35895153,15.52513572,12.1,0.002241234,-0.156428571,-0.279285714,0.322947263,0.239930397,0.182659211,0.084285714,15,0
155,2889.826087,40205.47826,5.04726087,12.26285714,14.9752657,15.32339346,15.47165698,12.42,0.008042255,0.247142857,0.045357143,0.325077634,0.247192305,0.195892287,0.157142857,15,0
156,2900.358696,38444.82609,4.711586957,12.17642857,15.13207364,15.48381839,15.63433653,12.5,0.003638095,-0.086428571,0.080357143,0.333450697,0.242089866,0.196360076,0.323571429,15,0
157,2906.652174,46544.17391,4.857769565,12.305,15.18397969,15.5568031,15.70366013,12.47,0.002167546,0.128571429,0.021071429,0.341358538,0.252728713,0.195716883,0.165,15,0
158,2908.097826,56485.3913,5.511108696,12.71928571,15.37370017,15.73769305,15.87546858,13.57,0.000497236,0.414285714,0.271428571,0.345740137,0.264638569,0.208990083,0.850714286,15,0
159,2899.829545,56070.04545,7.0604,13.39785714,15.56754996,15.9087406,16.02573604,13.78,-0.002847242,0.678571429,0.546428571,0.366770302,0.273138979,0.223005588,0.382142857,15,0
160,2900.847826,63313.78261,6.779082609,13.525,15.28368915,15.64969432,15.83751254,13.98,0.00035109,0.127142857,0.402857143,0.366382229,0.277688156,0.220584809,0.455,15,0
161,2890.543478,68272.47826,7.090704348,13.71357143,15.47235577,15.78640275,15.94478099,13.91,-0.003558509,0.188571429,0.157857143,0.359390502,0.278617867,0.225247844,0.196428571,15,0
162,2883.793478,69436.47826,7.497382609,14.33142857,15.6402008,15.95915432,16.08800793,15.07,-0.002337932,0.617857143,0.403214286,0.356560218,0.281686977,0.232936669,0.738571429,15,0
163,2875.22619,78123.90476,9.347904545,14.89285714,15.99178365,16.26900433,16.33704433,15.32,-0.002975261,0.561428571,0.589642857,0.367045154,0.277896252,0.234177571,0.427142857,15,0
164,2881.152174,52993.34783,8.922282609,14.36928571,15.79079903,16.08995536,16.14280576,14.93,0.002058928,-0.523571429,0.018928571,0.349271663,0.265606021,0.214501253,0.560714286,15,0
165,2883.48913,54204.69565,8.060656522,13.91357143,15.48441667,15.80220264,15.92435653,14.6,0.00081079,-0.455714286,-0.489642857,0.323614434,0.253646023,0.205745973,0.686428571,15,0
166,2888.097826,67233.73913,7.660304348,13.23571429,15.07891129,15.42314488,15.58274457,13.62,0.001597029,-0.677857143,-0.566785714,0.296243006,0.230886164,0.193030887,0.384285714,15,0
167,2896.152174,70073.21739,6.70863913,12.60357143,14.82580772,15.1931364,15.3356676,12.86,0.002784926,-0.632142857,-0.655,0.292372952,0.211570743,0.175887161,0.256428571,15,0
168,2906.75,55599.33333,6.195309091,12.14285714,14.57196837,14.98854749,15.12698335,12.32,0.003652599,-0.460714286,-0.546428571,0.29091158,0.211264105,0.163069544,0.177142857,15,0
169,2897.804348,49519.52174,6.243004348,12.88071429,14.59037096,15.03592401,15.15813849,13.68,-0.00308229,0.737857143,0.138571429,0.324392876,0.231441552,0.179281205,0.799285714,15,0
170,2898.315217,41567.91304,7.533043478,12.98142857,14.76017598,15.17209768,15.304741,13.29,0.00017628,0.100714286,0.419285714,0.343326721,0.245196978,0.186600955,0.308571429,15,0
171,2907.326087,23709.82609,6.561226087,12.19357143,14.79049269,15.19558271,15.71819127,12.76,0.00310418,-0.787857143,-0.343571429,0.33472549,0.241867385,0.184252563,0.566428571,15,0
172,2920.326087,15231,5.647086957,11.65571429,14.99671221,15.24287647,15.74743976,11.93,0.004461495,-0.537857143,-0.662857143,0.301632193,0.239970588,0.184958912,0.274285714,15,0
173,2936.607143,2576,4.854354545,11.66071429,14.88679775,15.16083499,15.66725146,11.95,0.005559598,0.005,-0.266428571,0.299420417,0.226321189,0.192058824,0.289285714,15,0
174,2925.720588,63163.76471,5.127969565,12.43285714,15.08763889,15.33028028,15.8209622,12.77,-0.003714077,0.772142857,0.388571429,0.339874641,0.239435457,0.193046082,0.337142857,15,0
175,2925.369565,44150.73913,4.842117391,12.22714286,14.87071228,15.1207528,15.59297566,12.56,-0.000119986,-0.205714286,0.283214286,0.349675205,0.250688302,0.188379003,0.332857143,15,0
176,2924.326087,55773.17391,5.079069565,12.18,14.94155844,15.19847591,15.68171123,13,-0.000356763,-0.047142857,-0.126428571,0.348177642,0.261245251,0.1997774,0.82,15,0
177,2917.75,50840.3913,7.447595652,12.435,15.05619208,15.2962844,15.7532831,12.97,-0.002251285,0.255,0.103928571,0.333390785,0.266600306,0.213371737,0.535,15,0
178,2919.261905,64534.2381,7.40125,12.58642857,15.04502896,15.2979602,15.78602273,13.11,0.000518041,0.151428571,0.203214286,0.343128091,0.253088016,0.215877489,0.523571429,15,0
179,2933.880435,52253.52174,7.095204348,11.86428571,14.68540791,14.980185,15.51191239,12.08,0.004995115,-0.722142857,-0.285357143,0.324693096,0.242580909,0.190853729,0.215714286,15,0
180,2927.141304,48263.04348,6.264952174,12.11571429,14.83569145,15.11268591,15.64417572,12.58,-0.002299645,0.251428571,-0.235357143,0.324774542,0.248680507,0.198177357,0.464285714,15,0
181,2933.793478,53625.86957,6.092686957,11.57714286,14.74765501,15.05300261,15.62016995,11.83,0.002270005,-0.538571429,-0.143571429,0.306603863,0.232753174,0.190100868,0.252857143,15,1
182,2913.521739,92305.52174,7.010656522,13.63857143,15.13379953,15.38812057,15.92695531,15.54,-0.006933719,2.061428571,0.761428571,0.383182822,0.27089836,0.219357803,1.901428571,15,1
183,2901.869048,106479.3333,9.538509091,15.01142857,15.38166384,15.57051171,16.07827751,16.74,-0.004007541,1.372857143,1.717142857,0.413001611,0.316315473,0.238533568,1.728571429,20,1
184,2887.619565,74112.91304,11.46806087,16.50142857,15.76403712,15.88311475,16.33217317,17.99,-0.004922546,1.49,1.431428571,0.475115169,0.340496404,0.278169777,1.488571429,20,1
185,2888.23913,75312.78261,12.17083043,16.25714286,15.83215103,15.9091354,16.35829787,17.43,0.000214536,-0.244285714,0.622857143,0.397332495,0.351061204,0.26836458,1.172857143,20,1
186,2856.543478,148903.4348,13.4374,18.23071429,16.62079613,16.4648318,16.84376499,22.96,-0.011034699,1.973571429,0.864642857,0.404818551,0.334175657,0.314943238,4.729285714,20,1
187,2762.097826,169761.8696,25.16064783,23.54285714,18.51012292,17.9467462,18.19388201,26.83,-0.033621847,5.312142857,3.642857143,0.475572101,0.392082223,0.345239342,3.287142857,25,1
188,2767.22619,127518.4762,27.96005,22.61285714,18.16475279,17.66769663,17.89844771,25.61,0.00185497,-0.93,2.191071429,0.463649678,0.342589386,0.301275219,2.997142857,25,0
189,2759.815217,74400.69565,24.27674348,21.45357143,18.45799419,17.87970588,18.07539033,22.83,-0.002681716,-1.159285714,-1.044642857,0.392260575,0.32990993,0.260020777,1.376428571,25,0
190,2778.228261,74504.78261,19.2532,19.07285714,17.88681117,17.56267925,17.86534268,20.5,0.006649681,-2.380714286,-1.77,0.270044498,0.261548407,0.234639719,1.427142857,20,0
191,2812.217391,82278.95652,14.65744348,17.8,17.26314801,17.76193277,17.85043783,18.93,0.012159871,-1.272857143,-1.826785714,0.262387601,0.18901699,0.19527485,1.13,20,1
192,2794.032609,94246.78261,16.50105217,19.01714286,17.63422819,17.8791762,17.86471302,21.13,-0.006487348,1.217142857,-0.027857143,0.295477498,0.210247015,0.161553398,2.112857143,20,0
193,2779.238095,92332.61905,19.20164545,19.525,18.067194,18.29235993,18.22314655,20.11,-0.005309108,0.507857143,0.8625,0.341235363,0.227526219,0.172689368,0.585,20,0
194,2766.043478,69746.08696,17.19002174,19.57928571,18.2267033,18.42590634,18.35273865,20.28,-0.004758872,0.054285714,0.281071429,0.366653291,0.25663808,0.182527052,0.700714286,20,0
195,2728.728261,120896.3043,16.43642174,22.42785714,18.84669091,18.94345898,18.82581132,23.78,-0.01358229,2.848571429,1.451428571,0.393116486,0.314997994,0.235180885,1.352142857,25,0
196,2719.554348,122070.1739,20.13960435,22.27071429,18.87651954,18.97135036,18.85941438,26.04,-0.003367638,-0.157142857,1.345714286,0.380208524,0.292771559,0.250232745,3.769285714,25,0
197,2684.423913,107857.3913,25.80222174,23.42857143,19.54379985,19.5248366,19.34470977,24.22,-0.013001877,1.157857143,0.500357143,0.398866635,0.299981708,0.246394231,0.791428571,25,0
198,2662.761905,160562.381,27.71229545,25.70214286,20.35689243,20.20418994,19.93932,27.48,-0.008102253,2.273571429,1.715714286,0.381997304,0.328180293,0.263274191,1.777857143,30,0
199,2669.032609,117867.6087,30.7666,23.80428571,20.19169701,20.11,19.86347305,25.4,0.002352194,-1.897857143,0.187857143,0.356286817,0.265342845,0.243157856,1.595714286,25,1
200,2661.967391,106414.1739,27.10964348,24.25785714,20.43115942,20.36819196,20.10780895,25.37,-0.002650618,0.453571429,-0.722142857,0.345132114,0.272306681,0.216318991,1.112142857,25,0
201,2706.108696,103035.7826,23.74234783,21.84285714,19.83739746,19.9241784,19.75201104,22.62,0.016446227,-2.415,-0.980714286,0.28328192,0.233079268,0.19615767,0.777142857,25,0
202,2723.98913,77616.52174,18.06110588,20.04857143,19.48107511,19.65541257,19.52608696,21.06,0.006585701,-1.794285714,-2.104642857,0.280741763,0.195008754,0.171146341,1.011428571,25,0
203,2739.702381,108515.9048,16.82169204,19.43642857,19.05205314,19.29094684,19.24767842,21.45,0.005751896,-0.612142857,-1.203214286,0.267080867,0.204127408,0.151243643,2.013571429,20,0
204,2725.065217,55306.91304,15.51646274,20.16857143,19.12910112,19.28569119,19.23635997,20.74,-0.005356934,0.732142857,0.06,0.307782865,0.20785607,0.16945328,0.571428571,25,0
205,2742.804348,54391.82609,12.892518,20.13571429,18.69958832,18.88627907,18.85366345,20.39,0.006488521,-0.032857143,0.349642857,0.334782196,0.230461086,0.166013957,0.254285714,25,0
206,2781.98913,80305.73913,14.12746774,17.18,17.67407273,18.03216967,18.11016104,17.89,0.014185305,-2.955714286,-1.494285714,0.294635748,0.214229728,0.157305428,0.71,20,0
207,2809.684783,56024.47826,12.77629704,16.505,17.09130271,17.55935765,17.69979625,16.91,0.009906114,-0.675,-1.815357143,0.272784153,0.21229466,0.164650135,0.405,20,0
208,2792.363636,75268.31818,11.33229473,17.43,17.44996136,17.86042673,17.94417555,17.96,-0.006183881,0.925,0.125,0.288542036,0.216053974,0.179353938,0.53,20,0
209,2766.771739,81946.82609,11.03740817,18.94571429,17.86238095,18.23114754,18.28026851,20.52,-0.009207215,1.515714286,1.220357143,0.367592439,0.235225257,0.187873636,1.574285714,20,0
210,2735.271739,90465.17391,13.44744809,19.98,18.65922576,18.88939283,18.85546757,20.41,-0.011450416,1.034285714,1.275,0.403514087,0.290745052,0.198453352,0.43,20,0
211,2721.271739,97414.26087,15.792296,20.755,19.09235552,19.31947329,19.22321429,21.83,-0.005131465,0.775,0.904642857,0.396921017,0.314374432,0.241618161,1.075,25,0
212,2705.728261,101775.087,20.17559074,21.01928571,19.42824511,19.671793,19.55785928,22.21,-0.005728218,0.264285714,0.519642857,0.369816016,0.301481436,0.254702038,1.190714286,25,0
213,2728.784091,82176.40909,20.37654614,19.75142857,19.14801678,19.46447264,19.42211382,20.83,0.008485018,-1.267857143,-0.501785714,0.329519996,0.260631881,0.226637161,1.078571429,20,0
214,2721.663043,84347,17.87767696,19.54071429,18.71220588,19.05798771,19.08015237,20.7,-0.002613016,-0.210714286,-0.739285714,0.313831435,0.244503432,0.206281104,1.159285714,20,0
215,2668.315217,108703.5217,17.10514778,22.16071429,20.04142442,20.14818653,20.01135321,23.24,-0.019795838,2.62,1.204642857,0.351434624,0.266932237,0.221828972,1.079285714,25,0
216,2655.445652,60230.56522,16.33185209,21.18857143,20.21015228,20.16426282,20.03723229,21.99,-0.004834774,-0.972142857,0.823928571,0.357587155,0.252013457,0.204177995,0.801428571,25,0
217,2638.618421,34025.94737,12.57272311,21.49272727,20.38090379,20.30444915,20.15785037,22.42,-0.00635704,0.304155844,-0.333993506,0.366631553,0.272040161,0.20450483,0.927272727,25,0
218,2656.717391,58042.6087,12.7515817,19.89928571,19.91347729,19.91506635,19.83899423,20.52,0.006835842,-1.593441558,-0.644642857,0.299317754,0.254587491,0.201497179,0.620714286,20,0
219,2664.225,14309.4,12.9010002,19.36,19.46602941,19.53940449,19.52922185,19.37,0.002821911,-0.539285714,-1.066363636,0.304566703,0.218404512,0.198150382,0.01,20,0