{
  "data_set_description": {
    "citation": "http://archive.ics.uci.edu/ml/datasets/Solar+Flare",
    "default_target_attribute": "c_class,m_class,x_class",
    "description": "Multivariate regression data set from: https://link.springer.com/article/10.1007%2Fs10994-016-5546-z : The Solar Flare dataset (Lichman 2013) has 3 target variables that correspond to the number of times 3 types of solar flare (common, moderate, severe) are observed within 24 h. There are two versions of this dataset. SF1 contains data from year 1969 and SF2 from year 1978.",
    "description_version": "1",
    "file_id": "20649404",
    "format": "ARFF",
    "id": "41407",
    "licence": "Public",
    "md5_checksum": "f87dba3c894d8cb29a22a2a7b7717d0c",
    "minio_url": "https://data.openml.org/datasets/0004/41407/dataset_41407.pq",
    "name": "sf2",
    "parquet_url": "https://data.openml.org/datasets/0004/41407/dataset_41407.pq",
    "processing_date": "2018-11-22 17:08:45",
    "status": "in_preparation",
    "tag": "2018_multitarget_regression",
    "upload_date": "2018-11-22T17:08:45",
    "url": "https://api.openml.org/data/v1/download/20649404/sf2.arff",
    "version": "1",
    "visibility": "public"
  }
}