{
  "data_qualities": {
    "quality": [
      {
        "name": "AutoCorrelation",
        "value": []
      },
      {
        "name": "ClassEntropy",
        "value": []
      },
      {
        "name": "Dimensionality",
        "value": "0.6463223787167449"
      },
      {
        "name": "EquivalentNumberOfAtts",
        "value": []
      },
      {
        "name": "MajorityClassPercentage",
        "value": []
      },
      {
        "name": "MajorityClassSize",
        "value": []
      },
      {
        "name": "MaxAttributeEntropy",
        "value": []
      },
      {
        "name": "MaxKurtosisOfNumericAtts",
        "value": "639.000000000002"
      },
      {
        "name": "MaxMeansOfNumericAtts",
        "value": "1710304.2253521131"
      },
      {
        "name": "MaxMutualInformation",
        "value": []
      },
      {
        "name": "MaxNominalAttDistinctValues",
        "value": []
      },
      {
        "name": "MaxSkewnessOfNumericAtts",
        "value": "25.27844931952907"
      },
      {
        "name": "MaxStdDevOfNumericAtts",
        "value": "1396817.2082978168"
      },
      {
        "name": "MeanAttributeEntropy",
        "value": []
      },
      {
        "name": "MeanKurtosisOfNumericAtts",
        "value": "107.26138917625758"
      },
      {
        "name": "MeanMeansOfNumericAtts",
        "value": "6548.693672600363"
      },
      {
        "name": "MeanMutualInformation",
        "value": []
      },
      {
        "name": "MeanNoiseToSignalRatio",
        "value": []
      },
      {
        "name": "MeanNominalAttDistinctValues",
        "value": []
      },
      {
        "name": "MeanSkewnessOfNumericAtts",
        "value": "7.287948029747226"
      },
      {
        "name": "MeanStdDevOfNumericAtts",
        "value": "7635.914382968958"
      },
      {
        "name": "MinAttributeEntropy",
        "value": []
      },
      {
        "name": "MinKurtosisOfNumericAtts",
        "value": "-2.006200446507946"
      },
      {
        "name": "MinMeansOfNumericAtts",
        "value": "0.0031298904538340847"
      },
      {
        "name": "MinMutualInformation",
        "value": []
      },
      {
        "name": "MinNominalAttDistinctValues",
        "value": []
      },
      {
        "name": "MinSkewnessOfNumericAtts",
        "value": "-25.278449319528974"
      },
      {
        "name": "MinStdDevOfNumericAtts",
        "value": "0.03955938860646193"
      },
      {
        "name": "MinorityClassPercentage",
        "value": []
      },
      {
        "name": "MinorityClassSize",
        "value": []
      },
      {
        "name": "NumberOfBinaryFeatures",
        "value": "0.0"
      },
      {
        "name": "NumberOfClasses",
        "value": []
      },
      {
        "name": "NumberOfFeatures",
        "value": "413.0"
      },
      {
        "name": "NumberOfInstances",
        "value": "639.0"
      },
      {
        "name": "NumberOfInstancesWithMissingValues",
        "value": "639.0"
      },
      {
        "name": "NumberOfMissingValues",
        "value": "10012.0"
      },
      {
        "name": "NumberOfNumericFeatures",
        "value": "413.0"
      },
      {
        "name": "NumberOfSymbolicFeatures",
        "value": "0.0"
      },
      {
        "name": "PercentageOfBinaryFeatures",
        "value": "0.0"
      },
      {
        "name": "PercentageOfInstancesWithMissingValues",
        "value": "100.0"
      },
      {
        "name": "PercentageOfMissingValues",
        "value": "3.7937606808459043"
      },
      {
        "name": "PercentageOfNumericFeatures",
        "value": "100.0"
      },
      {
        "name": "PercentageOfSymbolicFeatures",
        "value": "0.0"
      },
      {
        "name": "Quartile1AttributeEntropy",
        "value": []
      },
      {
        "name": "Quartile1KurtosisOfNumericAtts",
        "value": "5.8983567993972645"
      },
      {
        "name": "Quartile1MeansOfNumericAtts",
        "value": "0.021909233176838815"
      },
      {
        "name": "Quartile1MutualInformation",
        "value": []
      },
      {
        "name": "Quartile1SkewnessOfNumericAtts",
        "value": "2.4310764131755347"
      },
      {
        "name": "Quartile1StdDevOfNumericAtts",
        "value": "0.1930397326494886"
      },
      {
        "name": "Quartile2AttributeEntropy",
        "value": []
      },
      {
        "name": "Quartile2KurtosisOfNumericAtts",
        "value": "28.863335344626925"
      },
      {
        "name": "Quartile2MeansOfNumericAtts",
        "value": "0.08137715179968695"
      },
      {
        "name": "Quartile2MutualInformation",
        "value": []
      },
      {
        "name": "Quartile2SkewnessOfNumericAtts",
        "value": "5.252811090384264"
      },
      {
        "name": "Quartile2StdDevOfNumericAtts",
        "value": "0.3485214799714117"
      },
      {
        "name": "Quartile3AttributeEntropy",
        "value": []
      },
      {
        "name": "Quartile3KurtosisOfNumericAtts",
        "value": "102.31770961502363"
      },
      {
        "name": "Quartile3MeansOfNumericAtts",
        "value": "0.37871674491392804"
      },
      {
        "name": "Quartile3MutualInformation",
        "value": []
      },
      {
        "name": "Quartile3SkewnessOfNumericAtts",
        "value": "10.19791521013009"
      },
      {
        "name": "Quartile3StdDevOfNumericAtts",
        "value": "0.6347970536732986"
      },
      {
        "name": "StdvNominalAttDistinctValues",
        "value": []
      }
    ]
  }
}