{
  "data_set_description": {
    "citation": "J. Alcala-Fdez, A. Fernandez, J. Luengo, J. Derrac, S. Garcia, L. Sanchez, F. Herrera. KEEL Data-Mining Software Tool: Data Set Repository, Integration of Algorithms and Experimental Analysis Framework. Journal of Multiple-Valued Logic and Soft Computing 17:2-3 (2011) 255-287.",
    "collection_date": "09-10-2018",
    "contributor": "Andriy Mulyar",
    "creator": "KEEL",
    "default_target_attribute": "class",
    "description": "An imbalanced version of the White Wine Quality data set. where the possitive examples belong to the class 3 and the negative examples belong to the class 7. (IR: 44.0)",
    "description_version": "1",
    "file_id": "20649343",
    "format": "arff",
    "id": "41348",
    "language": "English",
    "licence": "Public",
    "md5_checksum": "fb182fd7e00567ea90b2011dd70c53dd",
    "minio_url": "https://data.openml.org/datasets/0004/41348/dataset_41348.pq",
    "name": "winequality-white-3_vs_7",
    "parquet_url": "https://data.openml.org/datasets/0004/41348/dataset_41348.pq",
    "processing_date": "2018-11-21 04:27:42",
    "status": "in_preparation",
    "tag": [
      "IR_44.0",
      "keel-imbalanced",
      "study_184"
    ],
    "upload_date": "2018-11-21T04:26:54",
    "url": "https://api.openml.org/data/v1/download/20649343/winequality-white-3_vs_7.arff",
    "version": "1",
    "version_label": "v1_unprocessed",
    "visibility": "public"
  }
}