{
  "data_set_description": {
    "citation": "J. Alcala-Fdez, A. Fernandez, J. Luengo, J. Derrac, S. Garcia, L. Sanchez, F. Herrera. KEEL Data-Mining Software Tool: Data Set Repository, Integration of Algorithms and Experimental Analysis Framework. Journal of Multiple-Valued Logic and Soft Computing 17:2-3 (2011) 255-287.",
    "collection_date": "09-10-2018",
    "contributor": "Andriy Mulyar",
    "creator": "KEEL",
    "default_target_attribute": "class",
    "description": "An imbalanced version of the Solar Flare data set. where the possitive examples belong to the class F and the negative examples to the rest of the classes. (IR: 23.79)",
    "description_version": "1",
    "file_id": "20649328",
    "format": "arff",
    "id": "41333",
    "language": "English",
    "licence": "Public",
    "md5_checksum": "c478f860e842eec094ac5e462c08e759",
    "minio_url": "https://data.openml.org/datasets/0004/41333/dataset_41333.pq",
    "name": "flare-F",
    "parquet_url": "https://data.openml.org/datasets/0004/41333/dataset_41333.pq",
    "processing_date": "2018-11-21 04:23:42",
    "status": "in_preparation",
    "tag": [
      "IR_23.79",
      "keel-imbalanced",
      "study_184"
    ],
    "upload_date": "2018-11-21T04:22:51",
    "url": "https://api.openml.org/data/v1/download/20649328/flare-F.arff",
    "version": "1",
    "version_label": "v1_unprocessed",
    "visibility": "public"
  }
}