{
  "data_qualities": {
    "quality": [
      {
        "name": "AutoCorrelation",
        "value": "1.0"
      },
      {
        "name": "ClassEntropy",
        "value": []
      },
      {
        "name": "Dimensionality",
        "value": "0.012311901504787962"
      },
      {
        "name": "EquivalentNumberOfAtts",
        "value": []
      },
      {
        "name": "MajorityClassPercentage",
        "value": "94.25444596443229"
      },
      {
        "name": "MajorityClassSize",
        "value": "689.0"
      },
      {
        "name": "MaxAttributeEntropy",
        "value": []
      },
      {
        "name": "MaxKurtosisOfNumericAtts",
        "value": "4.921636778086119"
      },
      {
        "name": "MaxMeansOfNumericAtts",
        "value": "0.8716812585499316"
      },
      {
        "name": "MaxMutualInformation",
        "value": []
      },
      {
        "name": "MaxNominalAttDistinctValues",
        "value": "3.0"
      },
      {
        "name": "MaxSkewnessOfNumericAtts",
        "value": "1.1112585835168665"
      },
      {
        "name": "MaxStdDevOfNumericAtts",
        "value": "0.37371203702968897"
      },
      {
        "name": "MeanAttributeEntropy",
        "value": []
      },
      {
        "name": "MeanKurtosisOfNumericAtts",
        "value": "0.9126429587738674"
      },
      {
        "name": "MeanMeansOfNumericAtts",
        "value": "0.40300586281024037"
      },
      {
        "name": "MeanMutualInformation",
        "value": []
      },
      {
        "name": "MeanNoiseToSignalRatio",
        "value": []
      },
      {
        "name": "MeanNominalAttDistinctValues",
        "value": "3.0"
      },
      {
        "name": "MeanSkewnessOfNumericAtts",
        "value": "0.1455345630535107"
      },
      {
        "name": "MeanStdDevOfNumericAtts",
        "value": "0.13181349784701932"
      },
      {
        "name": "MinAttributeEntropy",
        "value": []
      },
      {
        "name": "MinKurtosisOfNumericAtts",
        "value": "-0.07410133823767229"
      },
      {
        "name": "MinMeansOfNumericAtts",
        "value": "0.14437756497948018"
      },
      {
        "name": "MinMutualInformation",
        "value": []
      },
      {
        "name": "MinNominalAttDistinctValues",
        "value": "3.0"
      },
      {
        "name": "MinSkewnessOfNumericAtts",
        "value": "-0.6199296757454604"
      },
      {
        "name": "MinStdDevOfNumericAtts",
        "value": "0.027279421519638518"
      },
      {
        "name": "MinorityClassPercentage",
        "value": "5.745554035567715"
      },
      {
        "name": "MinorityClassSize",
        "value": "42.0"
      },
      {
        "name": "NumberOfBinaryFeatures",
        "value": "0.0"
      },
      {
        "name": "NumberOfClasses",
        "value": "2.0"
      },
      {
        "name": "NumberOfFeatures",
        "value": "9.0"
      },
      {
        "name": "NumberOfInstances",
        "value": "731.0"
      },
      {
        "name": "NumberOfInstancesWithMissingValues",
        "value": "0.0"
      },
      {
        "name": "NumberOfMissingValues",
        "value": "0.0"
      },
      {
        "name": "NumberOfNumericFeatures",
        "value": "7.0"
      },
      {
        "name": "NumberOfSymbolicFeatures",
        "value": "1.0"
      },
      {
        "name": "PercentageOfBinaryFeatures",
        "value": "0.0"
      },
      {
        "name": "PercentageOfInstancesWithMissingValues",
        "value": "0.0"
      },
      {
        "name": "PercentageOfMissingValues",
        "value": "0.0"
      },
      {
        "name": "PercentageOfNumericFeatures",
        "value": "77.77777777777779"
      },
      {
        "name": "PercentageOfSymbolicFeatures",
        "value": "11.11111111111111"
      },
      {
        "name": "Quartile1AttributeEntropy",
        "value": []
      },
      {
        "name": "Quartile1KurtosisOfNumericAtts",
        "value": "0.12867188525686046"
      },
      {
        "name": "Quartile1MeansOfNumericAtts",
        "value": "0.19096032831737347"
      },
      {
        "name": "Quartile1MutualInformation",
        "value": []
      },
      {
        "name": "Quartile1SkewnessOfNumericAtts",
        "value": "-0.6107856686981219"
      },
      {
        "name": "Quartile1StdDevOfNumericAtts",
        "value": "0.06799245387050688"
      },
      {
        "name": "Quartile2AttributeEntropy",
        "value": []
      },
      {
        "name": "Quartile2KurtosisOfNumericAtts",
        "value": "0.23239513604762063"
      },
      {
        "name": "Quartile2MeansOfNumericAtts",
        "value": "0.3913214774281806"
      },
      {
        "name": "Quartile2MutualInformation",
        "value": []
      },
      {
        "name": "Quartile2SkewnessOfNumericAtts",
        "value": "0.37408501654095866"
      },
      {
        "name": "Quartile2StdDevOfNumericAtts",
        "value": "0.08516180690608022"
      },
      {
        "name": "Quartile3AttributeEntropy",
        "value": []
      },
      {
        "name": "Quartile3KurtosisOfNumericAtts",
        "value": "0.6270853028775849"
      },
      {
        "name": "Quartile3MeansOfNumericAtts",
        "value": "0.5496922024623803"
      },
      {
        "name": "Quartile3MutualInformation",
        "value": []
      },
      {
        "name": "Quartile3SkewnessOfNumericAtts",
        "value": "0.4910730812896225"
      },
      {
        "name": "Quartile3StdDevOfNumericAtts",
        "value": "0.18179182152589976"
      },
      {
        "name": "StdvNominalAttDistinctValues",
        "value": "0.0"
      }
    ]
  }
}